program: Gaussian 09
title: 000202440
version: EM64L-G09RevD.01
frameworkgroup: C1[X(C17H19ClN2O2S)]
method: RPBEPBE
basis: SDD
operation: Freq
keyword: #p
keyword: freq=noraman
keyword: PBEPBE/SDD
title: #p freq=noraman PBEPBE/SDD
converged: YES YES NO NO
title: Mulliken charges:
elementType: Cl S O O N N C C C C C C C C C C C C C C C C C H H H H H H H H H H H H H H H H H H H
charge: -0.035898 0.646977 -0.414702 -0.590444 -0.217968 -0.103543 -0.333608 0.474521 0.453832 -0.424873 -0.319378 -0.280698 -0.369013 -0.295506 -0.359336 -0.225212 -0.247032 -0.123467 -0.221372 -0.232409 -0.231640 -0.607117 -0.623509 0.252148 0.248551 0.218598 0.263198 0.203395 0.213666 0.341320 0.321310 0.292171 0.287057 0.239852 0.267293 0.241763 0.225343 0.191029 0.223540 0.230383 0.226077 0.194697
chargesum: 0.00000
title: Mulliken charges with hydrogens summed into heavy atoms:
elementType: Cl S O O N N C C C C C C C C C C C C C C C C C
charge: -0.035898 0.646977 -0.414702 -0.590444 -0.217968 -0.103543 0.167091 0.474521 0.453832 0.056923 -0.319378 -0.280698 0.048048 0.045814 -0.038026 0.066960 0.040026 -0.123467 0.018480 0.034884 0.010123 0.032795 0.027647
polarizability: 1.96174825e+02 2.30597039e+01 2.71455300e+02 -4.70556346e+00 3.70341221e+00 2.33750640e+02
1716.lowfreq: -10.6153 -5.7745 -0.0013 -0.0007 0.0019 4.5209 11.9121 27.1555 36.5712
frequency: 11.4935 26.7201 36.5551 47.5269 66.8007 86.4028 105.3712 121.7162 135.9120 160.9401 162.6830 197.0224 202.9766 221.2187 237.3913 256.7601 259.1543 283.5829 287.8111 295.7786 322.4444 331.4811 352.1388 357.2433 362.0216 385.8579 414.6908 420.9147 449.5485 458.9968 482.9631 506.1861 527.6225 560.1895 564.0930 612.4504 630.5924 661.6567 666.9178 703.7726 726.4362 744.5061 753.6351 775.9278 798.5448 809.5937 829.5034 847.5334 870.5064 890.7967 903.2590 917.4327 942.5760 958.0266 963.7336 970.9650 986.1112 1001.1149 1005.2968 1018.6850 1032.8751 1033.8807 1060.3001 1068.7431 1077.2445 1089.9039 1095.6715 1102.6986 1130.8206 1138.2097 1141.5249 1164.2183 1167.0007 1209.9139 1214.3950 1240.6810 1253.4057 1267.9592 1284.9377 1309.8832 1356.1547 1363.2500 1367.9860 1389.4820 1395.7807 1417.8209 1420.1270 1426.8804 1429.9893 1440.2443 1444.1509 1459.9104 1463.0079 1474.1641 1474.8212 1485.7307 1490.2794 1576.3982 1580.8666 1589.6620 1597.6683 2845.8093 2853.9396 2869.6141 3005.0607 3016.5506 3020.1926 3021.4525 3027.3195 3072.4100 3078.8758 3082.8935 3102.0387 3135.8368 3140.5310 3146.1405 3153.8375 3158.5928 3170.7666 3177.1176
redmass: 3.9171 4.2338 4.1859 4.2761 3.6397 6.1701 3.7881 6.1892 7.8599 6.9719 4.2150 2.3382 3.0298 1.1924 3.2730 3.3012 2.6848 3.8941 3.3434 3.8281 4.8157 5.5989 5.7490 8.3103 2.2583 5.2191 2.2043 7.0866 3.7108 4.4416 6.5693 3.7749 4.5127 4.9464 4.7783 5.1745 5.6108 5.6331 6.5171 4.4528 4.2816 2.2645 5.7780 1.3027 1.9636 13.0248 1.3317 4.7309 2.4661 1.6895 1.6775 2.5071 2.0240 1.3932 2.1435 1.4822 6.2904 1.6498 3.3010 1.7345 1.8906 1.5628 2.0927 2.5902 1.6276 1.5207 3.8783 2.5523 1.5710 1.5622 1.3735 1.1517 1.4912 1.4425 1.5650 1.5089 1.8898 1.9248 1.2498 1.2231 1.5103 1.7942 2.1895 8.7849 7.7766 1.1411 2.3725 2.3093 2.2736 1.1518 1.1046 1.0522 1.0627 1.0833 1.0536 1.0557 1.0766 7.3967 8.5836 6.9867 7.9611 1.0691 1.0566 1.0578 1.0718 1.0707 1.0672 1.0717 1.0725 1.0988 1.1011 1.1006 1.1060 1.0870 1.0902 1.0900 1.0912 1.0927 1.1001 1.0954
irintensity: 0.0220 0.2099 0.1882 1.8707 0.1664 2.1882 0.2516 1.2870 3.0137 7.5411 3.1735 1.6448 0.8281 0.2417 1.5436 0.5905 0.9958 2.1651 4.4026 3.9338 1.6269 20.3767 4.5889 17.2938 6.8824 4.6938 0.6625 4.8288 3.6686 0.1571 8.5748 47.0072 2.5578 12.7001 3.2526 8.9479 3.5567 6.4848 11.9113 1.7226 6.1380 8.3767 52.1553 50.2631 18.4479 41.5113 39.5666 9.6212 19.7560 2.4412 2.5531 12.9964 11.4849 0.8332 31.8839 10.4447 13.9697 0.4411 5.0260 17.7849 12.0006 15.5946 15.7457 12.5200 0.1193 7.1402 53.7993 6.2076 0.3717 4.4882 10.6883 2.6930 0.0876 18.2793 26.2245 1.1419 13.3801 7.3120 4.0925 1.6078 11.8931 7.4598 1.3175 15.4085 3.8453 2.2806 76.3029 14.1540 17.4071 1.3213 4.3376 5.5635 13.7436 14.3151 12.1410 12.7206 12.6974 32.2528 8.7095 11.2456 2.6094 53.9498 64.8277 266.6688 4.6314 18.0695 8.1283 60.1668 33.7296 4.4644 21.8791 51.0764 20.5799 4.8737 3.2744 3.7546 25.1333 4.7504 33.0899 2.2733
temp: 298.150 k
press: 1.00000 atm
elementType: 17 16 8 8 7 7 6 6 6 6 6 6 6 6 6 6 6 6 6 6 6 6 6 1 1 1 1 1 1 1 1 1 1 1 1 1 1 1 1 1 1 1
symmnumber: 1
zpe: 852323.8 jmol-1
zpe.correction: 0.324633 hartree
zpe.thermalcorrener: 0.346983 hartree
zpe.thermalcorrenthalpy: 0.347928 hartree
zpe.thermalcorrgfe: 0.271561 hartree
zpe.sumelectzpe: -1775.397554 hartree
zpe.sumelectthermal: -1775.375203 hartree
zpe.sumelectthermalent: -1775.374259 hartree
zpe.sumelectthermalfe: -1775.450625 hartree
dipole: 3.1519 0.2564 -0.1862
dipole: 3.1678
quadrupole: -144.0478 -138.7247 -162.7975
quadrupole: -5.6147 -1.6517 -13.8211
quadrupole: 4.4755 9.7987 -14.2742 -5.6147 -1.6517 -13.8211
hfenergy: -1775.7221868 hartree
pointgroup: C01 [X(C17H19Cl1N2O2S1)]
dipole: 0.4821415 -1.1361448 -0.1732896 debye
polarizability: 235.788959|41.6401333|231.6903284|15.6586481|-1.0459573|233.9014778 unknown
InChI: InChI=1S/C17H19ClN2O2S/c1-19(2)10-5-11-20(21)14-6-3-4-7-16(14)23(22)17-9-8-13(18)12-15(17)20/h3-4,6-9,12H,5,10-11H2,1-2H3
charge 0 multiplicity 1
42 atoms
Cl 1.680947 4.599283 1.835455
S  -0.839264 0.027576 -2.030919
O  -0.090419 -0.230984 2.521882
O  -1.7261 0.851438 -3.17602
N  -0.200045 -0.284367 1.117014
N  3.017462 -2.671582 -0.842789
C  0.746612 -1.407365 0.579501
C  0.166362 1.064357 0.472764
C  -1.636251 -0.620433 0.676431
C  2.192199 -1.179948 1.024533
C  -0.0798 1.341967 -0.880443
C  -2.056317 -0.5061 -0.657904
C  3.07216 -2.379073 0.612764
C  0.689829 2.048317 1.323512
C  -2.545057 -0.998389 1.676326
C  0.184189 2.609345 -1.424597
C  -3.385994 -0.751434 -1.033034
C  0.981813 3.305912 0.763891
C  -3.882198 -1.278164 1.310828
C  0.73195 3.611048 -0.590831
C  -4.30541 -1.148806 -0.033158
C  3.565603 -4.007363 -1.159423
C  3.640742 -1.61633 -1.669389
H  0.33728 -2.329616 1.02426
H  0.669207 -1.47392 -0.520135
H  2.590777 -0.241313 0.596969
H  2.204542 -1.07039 2.123318
H  4.121025 -2.188301 0.958808
H  2.718958 -3.283214 1.145944
H  0.810902 1.782345 2.379048
H  -2.166666 -1.028821 2.703159
H  -0.077666 2.814171 -2.468899
H  -3.690669 -0.595085 -2.074151
H  -4.5997 -1.578547 2.081596
H  0.946707 4.608948 -0.982875
H  -5.348712 -1.343766 -0.302494
H  3.019322 -4.77928 -0.588599
H  4.65536 -4.107694 -0.922989
H  3.430846 -4.218381 -2.235324
H  3.132145 -0.648956 -1.512969
H  3.540331 -1.878652 -2.737373
H  4.728796 -1.472229 -1.446988
