program: Gaussian 09
title: 000202733
version: EM64L-G09RevD.01
frameworkgroup: C1[X(C19H25NO3)]
method: RPBEPBE
basis: SDD
operation: Freq
keyword: #p
keyword: freq=noraman
keyword: PBEPBE/SDD
title: #p freq=noraman PBEPBE/SDD
converged: NO NO NO NO
title: Mulliken charges:
elementType: O O O N C C C C C C C C C C C C C C C C C C C H H H H H H H H H H H H H H H H H H H H H H H H H
charge: -0.297309 -0.285731 -0.301150 -0.323422 -0.035388 -0.621980 -0.508782 -0.709473 0.576320 0.530922 -0.536059 -0.645978 -0.407955 -0.438492 0.257248 0.288852 0.032833 -0.231437 -0.232236 -0.256479 -0.517751 -0.531857 -0.520175 0.215629 0.204377 0.205000 0.243916 0.218191 0.204702 0.206943 0.230830 0.213184 0.299190 0.258527 0.227403 0.228103 0.223181 0.221923 0.228365 0.222026 0.261991 0.210880 0.234137 0.227470 0.233937 0.223668 0.215215 0.256692
chargesum: 0.00000
title: Mulliken charges with hydrogens summed into heavy atoms:
elementType: O O O N C C C C C C C C C C C C C C C C C C C
charge: -0.297309 -0.285731 -0.301150 -0.079506 0.180241 -0.212603 -0.085888 -0.058517 0.576320 0.530922 -0.236869 -0.387451 -0.180552 -0.210388 0.257248 0.288852 0.032833 -0.008256 -0.010313 -0.028114 0.177146 0.163687 0.175400
polarizability: 2.54790785e+02 5.42477475e+00 2.57526817e+02 1.38220612e+01 2.15764024e+00 1.59855316e+02
1716.lowfreq: -0.0008 -0.0006 -0.0002 2.0874 5.3391 7.2634 11.9635 21.1714 35.9873
frequency: 10.7779 21.0359 35.9096 45.4453 46.1133 61.3729 68.2346 84.3377 88.8765 106.7928 128.5780 129.0823 163.2311 177.0754 179.4184 191.2561 210.1730 219.9304 229.9254 234.4408 264.8728 273.5417 299.0010 314.3144 321.3745 342.2580 387.2257 405.4471 411.0979 435.3651 450.6319 479.8732 510.3695 515.5857 572.3122 585.3025 596.7051 606.7433 617.6728 640.5592 652.5473 704.0964 729.6935 751.6845 762.8803 807.6379 852.0016 853.3607 861.3034 867.3876 886.8121 887.9779 916.9686 929.4732 930.0719 950.2562 974.4867 978.9747 989.5723 992.4596 1010.6728 1026.1615 1052.1290 1058.2965 1066.6881 1101.6764 1104.9097 1108.3911 1111.4378 1113.2393 1126.5607 1152.8766 1155.7724 1159.0300 1159.6250 1170.0043 1178.5893 1186.9531 1189.2720 1214.6206 1215.5584 1251.4567 1283.3532 1305.5765 1310.5313 1319.8362 1332.4714 1355.0344 1377.5385 1380.6173 1382.2725 1403.0591 1418.9862 1437.5998 1438.7319 1443.1716 1447.1704 1451.4278 1455.2000 1462.0074 1463.8959 1467.1323 1474.5617 1478.1579 1478.4751 1482.5648 1483.3640 1483.5673 1485.7535 1584.9803 1592.2731 1603.7958 1613.3490 2885.2976 2965.3706 2967.8876 2967.9924 2972.4842 2973.0605 2973.4668 2977.5366 3029.5867 3058.4729 3062.0109 3070.4624 3076.6002 3079.7072 3108.8551 3112.2584 3115.6584 3121.4633 3121.5754 3127.9236 3138.5962 3146.5654 3158.0091 3163.3653 3444.8907
redmass: 4.4887 4.4610 2.7324 2.2889 3.7660 4.0752 3.1608 2.5520 2.8116 3.1605 3.3071 1.7290 1.3470 3.0919 3.1412 1.9992 2.5179 3.0476 2.5583 1.1499 4.5231 1.9669 5.0866 3.7456 3.2635 2.2141 4.4267 2.8290 4.3130 3.5098 2.4754 4.7749 3.4211 4.9318 4.2026 3.1259 4.1639 2.8351 6.3174 4.1253 2.3815 1.8782 4.5442 1.8727 3.8238 3.2920 2.0336 1.2961 2.0215 3.1235 1.4909 1.4425 1.6002 1.7741 5.2481 8.7691 1.4037 1.6922 5.0266 1.3736 4.8170 2.2073 2.6930 1.7963 5.5821 2.4143 1.5615 1.2638 1.2431 1.2377 2.6526 1.3635 1.4507 1.4680 2.6087 1.0611 1.2226 1.1477 1.9785 1.7994 1.8142 1.4968 1.3177 3.4360 1.6027 1.4826 1.3096 1.6109 2.4698 1.6413 6.2942 1.7437 1.2635 1.2663 2.0179 1.3793 1.2076 1.1480 1.0959 1.0776 1.0581 1.4716 1.0869 1.2334 1.1453 1.3412 2.0973 1.0673 1.0550 7.7459 6.0275 6.6793 6.1507 1.0687 1.0400 1.0604 1.0412 1.0330 1.0694 1.0505 1.0692 1.1009 1.1037 1.0994 1.0992 1.1014 1.0976 1.0871 1.0861 1.1036 1.1010 1.1046 1.0909 1.0959 1.0916 1.1013 1.0907 1.0742
irintensity: 0.4323 0.4008 1.8011 2.3078 0.0538 2.3016 0.9749 9.0017 1.0634 3.0592 0.1038 1.8275 1.7292 3.3126 3.0793 1.0396 0.3694 3.2295 1.9379 0.1121 6.2471 0.1894 4.7977 1.9182 2.0706 0.7825 7.0311 0.0913 1.2868 0.6034 10.2090 6.6378 22.1574 2.5331 15.4271 28.7219 10.4956 20.8710 0.1325 3.0545 59.4797 50.9361 19.4320 60.4600 6.7842 2.5851 0.2060 1.7334 13.0475 32.7554 5.5845 1.6263 4.5786 2.0237 11.8409 47.6111 2.0004 16.0795 0.2577 0.5087 30.4911 4.4801 14.1257 14.1549 245.5867 14.4706 10.2250 0.7653 8.1786 7.2950 28.5941 5.0612 23.1772 33.7590 76.4518 1.1227 11.4989 0.8565 36.1840 23.4509 24.8716 7.4298 7.0313 75.3842 38.6954 27.3678 1.7602 10.1793 3.1491 33.3193 0.5378 79.6752 8.2511 18.2635 6.8481 44.6287 32.8943 29.7003 4.1605 6.1406 15.4047 75.8539 3.2183 37.3308 14.3737 9.7693 14.6339 11.5118 25.0487 96.6842 1.1592 32.4121 8.6344 83.7886 19.2484 41.9740 41.4102 106.5961 56.1955 26.9212 60.6082 19.1237 33.4325 54.9285 41.4888 30.6767 41.1212 10.5160 4.3537 22.8318 30.2214 16.1376 11.9988 48.7621 4.9069 19.9170 5.0374 0.1210
temp: 298.150 k
press: 1.00000 atm
elementType: 8 8 8 7 6 6 6 6 6 6 6 6 6 6 6 6 6 6 6 6 6 6 6 1 1 1 1 1 1 1 1 1 1 1 1 1 1 1 1 1 1 1 1 1 1 1 1 1
symmnumber: 1
zpe: 1047757.5 jmol-1
zpe.correction: 0.399070 hartree
zpe.thermalcorrener: 0.423585 hartree
zpe.thermalcorrenthalpy: 0.424530 hartree
zpe.thermalcorrgfe: 0.342051 hartree
zpe.sumelectzpe: -1017.646649 hartree
zpe.sumelectthermal: -1017.622133 hartree
zpe.sumelectthermalent: -1017.621189 hartree
zpe.sumelectthermalfe: -1017.703668 hartree
dipole: 2.4795 -0.3159 -0.5109
dipole: 2.5513
quadrupole: -137.9364 -126.6941 -131.6966
quadrupole: 6.8806 3.0185 3.8376
quadrupole: -5.8274 5.4150 0.4125 6.8806 3.0185 3.8376
hfenergy: -1018.0457188 hartree
pointgroup: C01 [X(C19H25N1O3)]
dipole: 0.9842699 -0.1514563 -0.1255646 debye
polarizability: 252.1798584|4.4588321|256.834888|21.8139494|5.979328|163.1581709 unknown
InChI: InChI=1S/C19H25NO3/c1-14(10-15-8-6-5-7-9-15)20-13-16-11-17(21-2)19(23-4)18(12-16)22-3/h5-9,11-12,14,20H,10,13H2,1-4H3
charge 0 multiplicity 1
48 atoms
O  -4.555099 1.817941 -0.259705
O  -1.858444 -2.260901 -0.262227
O  -4.362463 -1.064752 -0.452901
N  1.529733 1.686276 -0.251945
C  2.846749 2.151521 0.23265
C  3.961409 1.255514 -0.380801
C  0.326403 2.222891 0.410714
C  3.138594 3.652642 -0.04396
C  3.861865 -0.207446 0.025846
C  -0.904821 1.355139 0.150677
C  -0.763876 -0.049073 0.038914
C  -2.184956 1.937643 0.07273
C  4.220595 -0.616821 1.336737
C  3.403757 -1.19378 -0.884415
C  -3.334188 1.132018 -0.12825
C  -1.903447 -0.858934 -0.153634
C  -3.204715 -0.277089 -0.264769
C  4.114812 -1.969605 1.731217
C  3.298707 -2.549761 -0.497498
C  3.652857 -2.943258 0.814393
C  -5.720379 1.326602 0.502546
C  -0.550279 -2.902012 -0.091083
C  -4.406672 -1.840571 -1.712052
H  2.851086 1.992489 1.331286
H  3.915289 1.344101 -1.485424
H  4.94008 1.673224 -0.072325
H  1.456273 1.698354 -1.278149
H  0.538209 2.235686 1.500727
H  0.086645 3.276337 0.131167
H  3.199839 3.844162 -1.133124
H  2.339631 4.294693 0.370114
H  4.096051 3.967938 0.413031
H  0.245261 -0.46529 0.106439
H  -2.328409 3.020169 0.156647
H  4.585202 0.130767 2.053562
H  3.124901 -0.89646 -1.903301
H  4.397463 -2.265923 2.74816
H  2.953717 -3.299424 -1.219539
H  3.578753 -3.994616 1.115339
H  -6.517245 2.06048 0.304886
H  -6.017525 0.32024 0.165629
H  -5.49087 1.304131 1.585814
H  -0.746368 -3.980932 -0.182027
H  0.1654 -2.580343 -0.871391
H  -0.123201 -2.678765 0.904946
H  -5.393035 -2.330617 -1.715558
H  -4.315421 -1.166153 -2.585179
H  -3.603266 -2.596636 -1.725616
