program: Gaussian 09
title: 000202472
version: EM64L-G09RevD.01
frameworkgroup: C1[X(C24H25NO)]
method: RPBEPBE
basis: SDD
operation: Freq
keyword: #p
keyword: freq=noraman
keyword: PBEPBE/SDD
title: #p freq=noraman PBEPBE/SDD
converged: YES YES NO NO
title: Mulliken charges:
elementType: O N C C C C C C C C C C C C C C C C C C C C C C C C H H H H H H H H H H H H H H H H H H H H H H H H H
charge: -0.300190 -0.303071 -0.139935 -0.595173 -0.574629 0.281341 0.297643 -0.392188 -0.422956 -0.427037 -0.223114 -0.228602 -0.293225 0.215755 0.333872 -0.695166 -0.362612 0.512346 -0.367719 -0.242215 -0.249611 -0.460368 -0.372842 -0.217134 -0.209639 -0.254077 0.222960 0.243720 0.225127 0.226421 0.222862 0.291863 0.197792 0.202222 0.236757 0.237588 0.220981 0.222008 0.220589 0.201209 0.211906 0.249962 0.246944 0.235269 0.223547 0.224804 0.224794 0.239143 0.221172 0.217148 0.223759
chargesum: 0.00000
title: Mulliken charges with hydrogens summed into heavy atoms:
elementType: O N C C C C C C C C C C C C C C C C C C C C C C C C
charge: -0.300190 -0.011207 0.083024 -0.126326 -0.125346 0.281341 0.297643 0.007825 -0.186199 -0.189449 -0.002133 -0.006595 0.128574 0.215755 0.333872 -0.233298 -0.115668 0.512346 -0.132450 -0.018669 -0.024807 -0.235573 -0.133699 0.004038 0.007509 -0.030317
polarizability: 2.55960942e+02 -2.99052367e+01 2.91075877e+02 -2.24254199e+00 -1.43644835e+01 2.09431011e+02
1716.lowfreq: -6.8986 -2.8839 -1.7440 -0.0002 0.0003 0.0004 4.4063 15.0390 20.4143
frequency: -3.6507 13.8246 20.0159 23.6208 29.1456 51.1741 65.0531 82.4956 111.0350 134.2345 157.1130 176.1436 193.6530 221.6660 225.3487 248.2309 267.9648 286.5552 334.4620 340.1565 352.3854 405.4939 416.0878 436.7241 440.8955 459.4020 465.4585 485.3647 492.7491 524.4026 538.3583 556.1316 586.3790 602.6842 610.9928 617.9707 670.2986 704.2206 705.1797 710.9445 722.7709 737.5608 745.7682 755.0842 759.2869 789.2260 809.2215 821.5244 829.5113 850.2582 853.8694 859.6026 863.9151 883.1798 897.3726 906.6215 920.9251 933.8803 937.3488 941.9911 958.2040 973.7189 974.3304 983.1674 990.3250 991.3804 1017.3727 1022.6710 1026.7411 1038.4634 1046.4395 1073.7936 1076.6922 1078.9602 1091.0135 1102.8117 1134.8845 1146.7209 1165.0034 1168.8264 1169.6005 1172.0031 1177.9338 1186.9935 1190.3974 1191.4592 1196.1708 1200.5506 1217.6932 1228.4557 1229.2322 1260.2803 1269.5457 1279.3447 1292.9902 1298.2587 1310.0618 1333.1728 1333.9037 1362.5726 1378.5035 1382.0094 1388.3711 1391.3464 1435.6504 1441.1474 1443.8303 1449.4381 1453.0567 1455.8205 1460.1919 1463.7974 1468.4296 1476.2367 1481.9893 1489.3707 1591.6241 1595.2425 1596.4467 1606.3047 1613.2247 1618.5490 2882.9715 2962.4938 2966.5037 2979.0374 2997.9087 3007.3521 3019.9031 3035.2416 3036.4543 3052.4568 3057.4252 3111.7587 3116.4323 3119.2570 3122.5290 3123.0678 3132.3326 3133.8399 3137.5255 3142.3010 3155.7699 3157.7658 3159.3829 3169.2496 3430.5724
redmass: 4.7088 4.9400 5.0183 4.6874 4.1958 4.4995 4.7309 4.6299 3.6753 3.4898 3.8941 3.5544 4.1518 3.6789 4.0512 3.9762 2.0092 4.4694 2.8375 2.4858 2.1683 2.8096 2.7882 2.9045 3.5453 3.0481 3.6945 3.1116 2.8540 3.7979 5.0381 4.6223 5.7214 4.9327 4.2495 5.9808 1.6684 2.2390 2.6317 3.6254 3.5999 1.8011 1.2985 1.5448 2.8001 3.2208 2.7634 3.4919 3.9259 1.2994 1.7427 1.7068 1.5084 1.9988 1.6001 2.1146 2.0515 1.7602 1.4645 1.7637 1.7360 1.3854 1.3216 1.3188 6.2185 1.3204 2.8543 2.2611 2.2396 2.1218 2.1728 1.7847 1.7185 2.0350 1.7530 2.0361 1.1365 3.0523 1.9940 1.0690 1.0712 1.1582 1.3177 1.2259 1.3827 1.5046 1.3450 2.4776 1.7363 1.6478 2.0260 1.7294 1.5085 1.7586 1.5495 1.3741 1.4714 1.2242 1.3024 1.3536 1.8504 4.8750 6.2281 3.8670 2.2474 2.2120 1.5193 1.4879 1.2238 1.1914 1.1612 1.1727 1.0985 2.2765 2.1849 2.0867 6.3428 6.6824 6.6955 6.2861 6.1634 7.1661 1.0697 1.0564 1.0653 1.0657 1.0593 1.0877 1.0859 1.1069 1.0971 1.1012 1.0967 1.0861 1.0852 1.0861 1.0868 1.0894 1.0915 1.0892 1.0944 1.0959 1.0938 1.1003 1.1015 1.0987 1.0740
irintensity: 0.0612 0.0215 0.0210 0.0040 0.1180 0.4295 0.3265 0.5740 1.1998 0.6597 1.7261 2.6044 0.1321 4.0127 9.4772 2.0384 6.5597 0.2766 0.1905 0.2018 1.9618 0.1687 11.8888 1.7461 3.4513 3.7735 1.8260 7.3666 0.0347 5.1301 1.8233 4.8523 1.0450 1.6896 9.1637 1.1559 97.9417 29.8840 14.2888 10.3034 4.9644 43.5881 55.8431 76.1857 35.1922 17.4745 6.6520 2.0625 0.8455 1.6611 5.8543 6.3220 3.3639 1.8407 1.6912 3.9042 3.4924 4.8983 3.8566 9.0646 10.9761 0.1275 0.3416 0.0707 0.1730 0.4641 55.4744 9.0832 7.9518 28.4765 13.5724 4.0641 5.5444 3.5638 1.0757 73.3409 0.9731 33.8758 4.0912 1.4087 0.6635 15.3004 2.1441 10.5045 41.1786 10.7543 16.3039 31.4880 4.6593 71.3305 62.8126 6.6377 1.6950 6.5186 0.6117 1.2452 3.8546 16.1914 1.0910 5.9807 2.5253 1.0183 3.1777 7.3460 30.3372 13.0314 4.4038 29.0485 15.0010 46.3349 46.4121 19.0821 10.1564 14.6281 33.1228 36.1782 0.2068 1.1731 8.8043 25.3657 13.9324 0.5006 69.2414 41.1268 32.2349 24.6534 23.9539 48.9973 85.3731 28.7820 37.1534 7.4913 17.0853 7.4770 4.3934 0.1613 4.5373 2.6929 15.7798 12.5530 34.4445 44.2418 32.7049 27.4109 26.9801 17.3077 4.8584
temp: 298.150 k
press: 1.00000 atm
elementType: 8 7 6 6 6 6 6 6 6 6 6 6 6 6 6 6 6 6 6 6 6 6 6 6 6 6 1 1 1 1 1 1 1 1 1 1 1 1 1 1 1 1 1 1 1 1 1 1 1 1 1
symmnumber: 1
zpe: 1115130.1 jmol-1
zpe.correction: 0.424731 hartree
zpe.thermalcorrener: 0.446492 hartree
zpe.thermalcorrenthalpy: 0.447436 hartree
zpe.thermalcorrgfe: 0.370937 hartree
zpe.sumelectzpe: -1057.660672 hartree
zpe.sumelectthermal: -1057.638911 hartree
zpe.sumelectthermalent: -1057.637966 hartree
zpe.sumelectthermalfe: -1057.714465 hartree
dipole: -0.1006 -1.8193 -0.3078
dipole: 1.8479
quadrupole: -153.1140 -134.9726 -149.0804
quadrupole: -2.3393 -0.8850 -2.4450
quadrupole: -7.3917 10.7498 -3.3581 -2.3393 -0.8850 -2.4450
hfenergy: -1058.0854023 hartree
pointgroup: C01 [X(C24H25N1O1)]
dipole: -0.2036588 0.227094 0.6599241 debye
polarizability: 244.4345133|6.8054587|247.5319762|14.1923744|49.1790317|264.5013401 unknown
InChI: InChI=1S/C24H25NO/c1-2-8-19(9-3-1)16-22-12-6-7-13-24(22)26-15-14-25-23-17-20-10-4-5-11-21(20)18-23/h1-13,23,25H,14-18H2
charge 0 multiplicity 1
51 atoms
O  1.199564 0.788345 1.75106
N  -1.616688 1.345103 1.446766
C  -3.07567 1.092927 1.460626
C  -3.657765 1.338335 0.031585
C  -3.488535 -0.396278 1.77936
C  -3.668917 -0.046982 -0.601603
C  -3.569434 -1.045352 0.404287
C  -0.931372 1.288927 2.748692
C  -3.766561 -0.40804 -1.960189
C  -3.562466 -2.411198 0.05763
C  -3.758203 -1.780945 -2.310308
C  -3.657286 -2.775872 -1.308552
C  0.513195 1.768923 2.613955
C  2.546631 1.026765 1.408163
C  3.145459 0.05306 0.556997
C  2.356684 -1.15759 0.067252
C  3.280417 2.147433 1.867988
C  1.782739 -1.007627 -1.345211
C  4.492543 0.247921 0.177078
C  4.625923 2.312512 1.469088
C  5.237545 1.365132 0.620342
C  1.988268 -2.020965 -2.314574
C  1.012743 0.128927 -1.706803
C  1.435824 -1.909113 -3.611871
C  0.457311 0.242389 -2.999589
C  0.665817 -0.776477 -3.958923
H  -3.515742 1.787831 2.200483
H  -3.049567 2.079208 -0.516356
H  -4.68837 1.740806 0.099992
H  -2.772275 -0.89424 2.459028
H  -4.479329 -0.420111 2.278844
H  -1.130408 0.771172 0.742024
H  -0.923206 0.277094 3.222313
H  -1.45338 1.970469 3.450229
H  -3.837808 0.359358 -2.740189
H  -3.478654 -3.184877 0.830279
H  -3.819915 -2.075999 -3.364051
H  -3.644129 -3.834143 -1.593633
H  0.537275 2.768102 2.136032
H  1.013553 1.810042 3.603174
H  3.011313 -2.048851 0.090556
H  1.526027 -1.345448 0.772048
H  2.819037 2.889001 2.526417
H  4.960351 -0.4921 -0.483732
H  5.190006 3.182136 1.82452
H  6.279705 1.491667 0.308955
H  2.582923 -2.905133 -2.05146
H  0.854772 0.927244 -0.972131
H  1.607111 -2.703196 -4.348034
H  -0.137956 1.125519 -3.25999
H  0.235405 -0.687412 -4.962865
