program: Gaussian 09
title: 000202432
version: EM64L-G09RevD.01
frameworkgroup: C1[X(C13H27NO2)]
method: RPBEPBE
basis: SDD
operation: Freq
keyword: #p
keyword: freq=noraman
keyword: PBEPBE/SDD
title: #p freq=noraman PBEPBE/SDD
converged: YES YES NO NO
title: Mulliken charges:
elementType: O O N C C C C C C C C C C C C C H H H H H H H H H H H H H H H H H H H H H H H H H H H
charge: -0.425205 -0.240397 -0.075284 0.303104 -0.092607 -0.095294 -0.486762 -0.409760 0.087390 -0.753878 -0.758944 -0.744129 -0.742677 -0.373014 -0.626359 -0.616399 0.241855 0.223587 0.219398 0.237573 0.209616 0.216967 0.214965 0.215190 0.230990 0.223624 0.213162 0.236104 0.236168 0.225351 0.206530 0.208053 0.230861 0.231393 0.172789 0.214853 0.373608 0.184026 0.219305 0.232375 0.225628 0.220659 0.185585
chargesum: 0.00000
title: Mulliken charges with hydrogens summed into heavy atoms:
elementType: O O N C C C C C C C C C C C C C
charge: -0.051597 -0.240397 -0.075284 0.303104 0.149248 0.128293 -0.029791 0.016823 0.087390 -0.092732 -0.086054 -0.076079 -0.072370 0.014628 0.009346 0.015474
polarizability: 1.73258488e+02 1.69688089e+00 1.45718040e+02 -1.13518172e-01 1.16311983e+00 1.43750506e+02
1716.lowfreq: -23.7835 -5.3615 -0.0007 -0.0006 0.0001 12.9849 30.3696 32.3942 39.8544
frequency: 29.8954 31.6490 39.2268 66.8133 81.6361 102.1236 132.6890 141.3515 163.7402 165.0453 181.8287 192.8425 205.9046 218.3592 221.1596 238.1868 248.5373 261.5921 274.8243 315.4725 333.3177 343.0017 351.3223 362.8411 380.4048 413.9876 432.2693 440.4621 462.3407 481.1623 514.1808 600.0491 628.4147 664.8909 714.8609 746.2927 810.6039 821.2332 862.7470 878.9738 912.0666 919.2158 928.6585 950.8167 957.3532 970.0999 998.0787 1022.0238 1034.1719 1049.3482 1062.9699 1072.1301 1090.2379 1093.0931 1116.9572 1122.6051 1140.5694 1150.6822 1174.6022 1175.5201 1181.5881 1195.5901 1231.9945 1260.3133 1266.0367 1284.1466 1294.1550 1304.7063 1315.1233 1318.4516 1334.9726 1340.8886 1367.8733 1372.9019 1382.5974 1388.7411 1400.9010 1406.6258 1418.7953 1442.0107 1457.4119 1460.3556 1462.6897 1465.9473 1471.1208 1473.1891 1474.7185 1478.8731 1480.3021 1482.8273 1485.9495 1487.7318 1488.5989 1494.7963 1500.8341 1630.2024 2808.8407 2838.2862 2855.7524 2975.0862 2979.8461 2984.4987 2987.2449 2992.8003 2996.7956 2998.8165 3006.3644 3008.8398 3016.1852 3028.4923 3048.0619 3065.5550 3066.7584 3069.7078 3071.4469 3073.4802 3073.7784 3075.6283 3084.7179 3086.1748 3088.7652 3098.4616 3493.1012
redmass: 3.3434 3.2338 3.6328 3.9924 2.3646 2.4609 2.1601 2.2588 3.5765 3.3230 1.7078 1.7873 1.3739 1.1974 1.6755 1.1579 1.2772 1.2949 2.1503 2.4970 2.7321 2.6204 2.2728 2.9029 3.3372 2.4645 2.2945 2.4634 2.7616 2.8485 3.2737 1.9082 1.8409 2.8868 3.6487 1.2601 2.2725 2.9414 2.6370 1.9198 2.3057 1.2011 1.2198 1.7661 1.4078 1.5796 2.6356 2.7632 1.5637 2.1348 2.6108 2.1333 1.8998 1.4879 1.7343 2.1242 1.7692 2.1354 2.1680 1.9982 2.1154 2.5602 1.6979 1.9986 2.0399 1.5397 1.1690 1.2484 1.3409 1.3018 1.3041 1.2960 1.3716 1.4012 1.2072 1.2009 1.2008 1.1931 1.1434 1.1571 1.0701 1.0603 1.0594 1.0537 1.0486 1.0535 1.0665 1.0502 1.0472 1.0666 1.0532 1.0549 1.0542 1.0455 1.0659 8.3279 1.0702 1.0577 1.0576 1.0356 1.0362 1.0366 1.0378 1.0685 1.0753 1.0731 1.0748 1.0830 1.0717 1.0714 1.0955 1.1001 1.0984 1.0990 1.1002 1.0990 1.0989 1.1010 1.0994 1.1002 1.0983 1.0976 1.0636
irintensity: 0.1263 1.0504 0.2076 0.0979 0.3753 0.4780 0.8409 0.0842 0.7802 0.2548 0.2035 0.2780 0.2441 0.3145 0.0487 0.6257 0.1155 0.6780 2.0882 3.2036 6.4114 2.0154 0.5024 5.1622 2.2117 2.4789 1.5751 3.0891 4.6779 8.2827 3.2528 65.8781 64.2778 5.5905 25.2601 16.3675 8.9201 19.3440 5.3776 0.2506 1.4436 3.8275 5.4941 13.0377 1.3251 0.4080 83.4276 86.6149 23.4969 56.2562 28.2051 19.9595 7.4259 5.9794 12.0249 17.7885 7.2655 8.6568 2.7418 10.9484 13.5278 12.1497 9.1567 3.0187 10.9986 5.1485 0.2419 11.7339 8.7874 1.2229 0.3960 4.0360 7.2655 6.4353 19.3231 12.9392 35.4943 14.5531 2.0615 2.5929 4.3113 5.7127 19.2815 1.5044 5.0507 9.3289 5.6479 5.2297 12.5083 10.4215 15.7863 13.5093 10.5219 17.2136 0.3174 199.9307 74.9716 72.9777 221.1019 28.1144 27.0452 34.0428 25.4080 3.5365 13.2785 5.6169 60.5114 3.8430 47.2962 44.5793 2.5950 14.6446 22.9146 84.2248 30.2786 36.9294 35.5308 32.8702 58.9087 32.7613 38.3171 38.6614 19.3970
temp: 298.150 k
press: 1.00000 atm
elementType: 8 8 7 6 6 6 6 6 6 6 6 6 6 6 6 6 1 1 1 1 1 1 1 1 1 1 1 1 1 1 1 1 1 1 1 1 1 1 1 1 1 1 1
symmnumber: 1
zpe: 1002918.5 jmol-1
zpe.correction: 0.381991 hartree
zpe.thermalcorrener: 0.402577 hartree
zpe.thermalcorrenthalpy: 0.403521 hartree
zpe.thermalcorrgfe: 0.333098 hartree
zpe.sumelectzpe: -715.424801 hartree
zpe.sumelectthermal: -715.404216 hartree
zpe.sumelectthermalent: -715.403272 hartree
zpe.sumelectthermalfe: -715.473695 hartree
dipole: -1.5126 -1.3811 0.1041
dipole: 2.0509
quadrupole: -107.6153 -102.0958 -96.8478
quadrupole: -1.0328 0.3828 1.2048
quadrupole: -5.4290 0.0905 5.3385 -1.0328 0.3828 1.2048
hfenergy: -715.8067925 hartree
pointgroup: C01 [X(C13H27N1O2)]
dipole: 0.5754812 0.5312991 -0.1939381 debye
polarizability: 173.093453|2.3132751|144.6784096|-1.4010965|-1.6020446|144.955172 unknown
InChI: InChI=1S/C13H27NO2/c1-10(2)13(11(3)4,12(15)16)8-7-9-14(5)6/h10-11,15H,7-9H2,1-6H3
charge 0 multiplicity 1
43 atoms
O  -2.000014 0.317587 -2.299565
O  -3.498444 -0.686944 -0.872959
N  3.966006 -0.112398 -0.045349
C  -1.218699 -0.131589 0.005417
C  -1.513047 -1.286041 1.056377
C  -1.345923 1.304348 0.691726
C  0.157956 -0.284223 -0.730819
C  1.441225 -0.160814 0.124366
C  -2.346124 -0.224632 -1.045716
C  -1.205583 -2.69053 0.477384
C  -0.833669 -1.125888 2.43944
C  -0.955418 2.488287 -0.22737
C  -2.743775 1.564655 1.30775
C  2.683201 -0.036118 -0.784916
C  4.183822 1.03136 0.863169
C  5.114346 -0.309155 -0.953926
H  -2.606095 -1.256047 1.227126
H  -0.614907 1.284571 1.523621
H  0.172995 -1.263312 -1.247047
H  0.197808 0.468802 -1.537222
H  1.375025 0.718053 0.793038
H  1.58542 -1.048708 0.765993
H  -1.594591 -3.468925 1.159472
H  -0.119249 -2.862748 0.363733
H  -1.687979 -2.844005 -0.505335
H  -1.165326 -0.217264 2.972475
H  -1.106919 -1.990583 3.073267
H  0.266471 -1.101198 2.372302
H  -1.59809 2.540328 -1.123982
H  0.093238 2.429723 -0.567875
H  -1.070875 3.436981 0.329637
H  -2.732277 2.517809 1.868203
H  -3.524262 1.643006 0.52916
H  -3.053399 0.767758 2.005174
H  2.605941 0.913404 -1.38252
H  2.670467 -0.871024 -1.51322
H  -2.794727 0.238916 -2.896251
H  4.213479 2.017125 0.32916
H  5.144496 0.901389 1.392852
H  3.385888 1.077554 1.623084
H  4.957244 -1.218786 -1.560781
H  6.037219 -0.448525 -0.362254
H  5.282247 0.549301 -1.654716
