program: Gaussian 09
title: 000202402
version: EM64L-G09RevD.01
frameworkgroup: C1[X(C12H18N2O3)]
method: RPBEPBE
basis: SDD
operation: Freq
keyword: #p
keyword: freq=noraman
keyword: PBEPBE/SDD
title: #p freq=noraman PBEPBE/SDD
converged: YES YES NO NO
title: Mulliken charges:
elementType: O O O N N C C C C C C C C C C C C H H H H H H H H H H H H H H H H H H
charge: -0.336376 -0.257137 -0.416248 -0.233271 -0.384440 0.113567 0.397189 0.415654 -0.527557 -0.643835 0.388281 -0.816567 -0.814155 -0.629574 -0.630765 0.312456 -0.320583 0.305041 0.253555 0.239423 0.231679 0.222787 0.225703 0.231357 0.229897 0.236390 0.211984 0.206524 0.232730 0.203676 0.216593 0.328395 0.208487 0.264838 0.334304
chargesum: 0.00000
title: Mulliken charges with hydrogens summed into heavy atoms:
elementType: O O O N N C C C C C C C C C C C C
charge: -0.336376 -0.257137 -0.081944 -0.233271 -0.056045 0.113567 0.397189 0.415654 -0.222516 -0.390280 0.388281 -0.122677 -0.127198 0.025323 0.022233 0.312456 0.152742
polarizability: 2.44714454e+02 2.80236370e+00 1.59060641e+02 -2.20378716e+00 2.62870129e+00 9.55221047e+01
1716.lowfreq: -7.8460 -4.6018 -0.0007 -0.0001 0.0006 6.6597 17.0164 29.5870 57.8476
frequency: 14.6237 29.5572 57.6964 69.6534 77.3401 107.5133 111.7670 118.4501 159.6724 171.9513 183.0541 210.0149 213.5292 221.7799 231.6734 234.5908 247.6041 286.6946 289.3984 313.9157 332.6948 359.3973 443.8219 468.0425 499.3155 512.3185 516.7281 559.6929 592.7981 602.2903 616.2386 680.5193 687.1647 697.7733 753.5971 852.2370 874.8456 906.8581 925.1297 943.1315 957.8090 959.5089 1006.4305 1026.3334 1034.0574 1044.0670 1046.7181 1062.0630 1089.1353 1094.8946 1131.0610 1136.2331 1151.6164 1169.8974 1221.2148 1229.7925 1249.0517 1291.5658 1324.4378 1354.5764 1357.5741 1390.4423 1395.3884 1407.6314 1423.9584 1428.3458 1432.4153 1446.2317 1450.8020 1457.3533 1458.4336 1466.9921 1472.7898 1477.0861 1482.6524 1489.6686 1498.5031 1518.4840 1579.4038 1609.2839 1682.2397 2892.0522 2900.5204 2968.8462 2971.8773 2974.8105 2978.3759 2996.4044 3051.4556 3056.8269 3081.0067 3086.4876 3090.4554 3093.8883 3128.8796 3147.2003 3191.0866 3556.2849 3564.1215
redmass: 5.3523 5.4405 2.0991 4.6616 5.4210 5.4898 2.7957 1.8499 1.2032 1.1777 1.7373 1.4377 1.6203 2.7168 2.3677 3.4708 3.0554 2.1219 2.5557 3.6075 2.4279 2.7753 4.5810 4.0731 4.2739 3.2534 3.4720 4.6380 1.8354 1.9070 3.8469 4.7307 6.6402 8.5584 4.1814 4.1772 1.3979 1.3477 6.0129 2.9594 3.7226 3.0662 1.8328 1.7099 1.6535 1.5593 1.5168 1.4099 1.9573 1.4980 1.5637 2.2371 2.0326 1.9893 3.1103 1.4643 1.8048 5.4043 1.1782 3.1436 7.0299 1.2641 1.2580 1.1345 1.3347 1.5579 2.0941 1.0842 1.1914 1.0902 1.0924 1.1241 1.1167 1.3971 1.2092 1.1595 1.1809 1.2427 7.6567 6.1075 9.2507 1.0477 1.0504 1.0807 1.0458 1.0851 1.0406 1.0682 1.0924 1.0957 1.0947 1.0994 1.0996 1.0941 1.0976 1.0920 1.0926 1.0664 1.0775
irintensity: 5.7401 3.6879 4.2530 0.2459 1.6605 3.1280 12.1268 0.3719 1.7294 1.7541 3.2379 6.5190 8.2702 0.3331 6.0167 0.4436 8.5077 47.5782 22.3639 14.2047 119.1200 0.5370 7.0053 13.4868 2.4910 1.0803 25.8869 2.6347 49.4620 75.2163 29.3122 3.1566 5.9059 38.3260 2.0579 34.8267 15.4262 21.5376 267.7203 145.1218 3.3265 5.0880 87.1952 3.3727 46.3700 13.1336 1.9144 9.0281 95.3522 0.7720 12.3685 1.9078 548.3078 279.1363 18.0779 290.6610 16.8962 42.8328 1.0189 1.0480 5.1588 18.9812 14.4067 22.2904 10.0747 88.1976 4.2423 8.0772 28.6222 33.6943 24.7366 17.4353 130.7729 376.3006 48.0312 8.7318 26.8015 38.4941 14.5668 6.4454 217.9245 76.0162 240.4880 79.6753 80.4325 15.0954 38.8387 80.9433 22.2233 19.2922 24.3174 18.8347 28.3682 14.7412 2.9173 7.8561 3.1892 7.4863 29.5552
temp: 298.150 k
press: 1.00000 atm
elementType: 8 8 8 7 7 6 6 6 6 6 6 6 6 6 6 6 6 1 1 1 1 1 1 1 1 1 1 1 1 1 1 1 1 1 1
symmnumber: 1
zpe: 750129.1 jmol-1
zpe.correction: 0.285709 hartree
zpe.thermalcorrener: 0.304958 hartree
zpe.thermalcorrenthalpy: 0.305902 hartree
zpe.thermalcorrgfe: 0.236832 hartree
zpe.sumelectzpe: -801.933295 hartree
zpe.sumelectthermal: -801.914047 hartree
zpe.sumelectthermalent: -801.913102 hartree
zpe.sumelectthermalfe: -801.982173 hartree
dipole: -1.4355 3.9842 -0.2185
dipole: 4.2405
quadrupole: -84.1134 -97.2200 -102.5784
quadrupole: 19.7456 -3.9769 1.2993
quadrupole: 10.5238 -2.5827 -7.9411 19.7456 -3.9769 1.2993
hfenergy: -802.2190042 hartree
pointgroup: C01[X(C12H18N2O3)]
dipole: -0.4933509 -1.5760452 0.2367476 debye
polarizability: 244.3591193|0.2583396|159.0257298|-8.4138102|-1.9628197|95.9123511 unknown
InChI: InChI=1S/C12H18N2O3/c1-8-5-10(17-12(16)13-7-15)6-9(2)11(8)14(3)4/h5-6,13,15H,7H2,1-4H3
charge 0 multiplicity 1
35 atoms
O  1.91648 -0.655256 0.062625
O  2.854873 1.53888 0.115825
O  5.905797 0.42921 -1.428773
N  -3.702753 0.205903 0.260127
N  4.154213 -0.420808 0.073463
C  -2.286367 0.00623 0.191245
C  -1.41937 1.14601 0.142751
C  -1.717715 -1.31126 0.180587
C  -0.014067 0.97549 0.087246
C  -0.313934 -1.45875 0.157382
C  0.523461 -0.326944 0.108154
C  -1.982809 2.554579 0.185635
C  -2.591921 -2.553395 0.135077
C  -4.436195 0.765003 -0.879642
C  -4.516231 -0.42516 1.300425
C  2.963154 0.293607 0.081622
C  5.444554 0.239774 -0.048958
H  0.645505 1.844208 0.058342
H  0.141187 -2.454538 0.145256
H  -2.911993 2.578457 0.781679
H  -1.252828 3.257339 0.622195
H  -2.234857 2.93247 -0.825035
H  -2.009925 -3.427669 -0.2033
H  -3.021914 -2.804749 1.123348
H  -3.439757 -2.412236 -0.558868
H  -3.737776 1.256655 -1.57568
H  -5.180388 1.519907 -0.548806
H  -4.986457 -0.016868 -1.453853
H  -3.882941 -0.69048 2.163513
H  -5.050362 -1.344823 0.965524
H  -5.287152 0.289862 1.657251
H  4.080615 -1.439169 0.069505
H  6.186381 -0.335467 0.539686
H  5.349142 1.262212 0.343002
H  6.066253 -0.451224 -1.855048
