program: Gaussian 09
title: 000202391
version: EM64L-G09RevD.01
frameworkgroup: C1[X(C12H17N)]
method: RPBEPBE
basis: SDD
operation: Freq
keyword: #pfreq=noraman
keyword: PBEPBE/SDD
title: #p freq=noraman PBEPBE/SDD
converged: YES YES NO NO
title: Mulliken charges:
elementType: N C C C C C C C C C C C C H H H H H H H H H H H H H H H H H
charge: -0.046956 -0.217460 -0.431875 -0.431307 -0.390908 -0.389848 0.544296 -0.618495 -0.473517 -0.401878 -0.222456 -0.249838 -0.247907 0.201652 0.207733 0.211752 0.214074 0.207672 0.215043 0.170592 0.170375 0.215158 0.223297 0.223136 0.184579 0.230960 0.231403 0.222523 0.221815 0.226387
chargesum: 0.00000
title: Mulliken charges with hydrogens summed into heavy atoms:
elementType: N C C C C C C C C C C C C
charge: -0.046956 -0.015808 -0.012390 -0.009561 -0.005273 -0.004316 0.544296 0.012517 -0.242557 -0.170475 0.000067 -0.028023 -0.021521
polarizability: 1.78075781e+02 -1.71415784e-01 1.18221442e+02 5.53907406e-01 -8.61396051e+00 9.58324629e+01
1716.lowfreq: -18.4382 -12.0202 -3.9457 -0.0006 0.0005 0.0005 35.0974 61.9791 89.2838
frequency: 34.2881 61.9621 89.1457 170.1226 213.1941 240.4925 246.3401 273.6027 278.4583 354.0277 359.6558 404.5973 465.2189 465.8886 518.1326 535.6238 616.7874 637.1335 706.1086 739.5113 768.7992 803.6247 810.4165 851.4083 882.1967 903.2290 930.5946 972.3500 979.2803 989.2528 992.3432 994.1088 1026.8631 1041.4139 1064.6455 1066.9459 1090.0685 1106.5543 1128.5811 1139.2292 1153.1707 1170.7824 1188.2187 1193.5597 1208.5137 1255.3725 1270.5050 1273.3434 1298.1495 1302.5330 1329.0837 1332.3047 1348.8468 1360.3614 1373.7383 1384.9473 1430.6602 1441.5110 1448.6633 1457.8701 1461.6333 1462.6673 1477.8947 1480.6959 1482.8246 1591.1545 1613.3154 2802.9985 2813.7728 2850.1964 2953.8031 2988.5007 2991.0827 3016.7111 3019.1172 3024.7468 3051.5820 3057.2731 3075.8027 3112.2549 3115.4497 3130.1523 3140.9889 3160.1111
redmass: 3.3995 3.3890 3.5239 3.1658 1.2114 1.8167 4.8499 2.6304 2.6893 2.3266 1.8856 2.8139 2.7701 2.9648 2.6254 2.9986 6.3931 4.0052 1.6572 3.4810 1.9614 2.6186 1.4946 1.2476 3.1011 1.6134 1.6448 1.3918 1.4429 4.4460 1.3112 2.6290 2.2354 2.2048 1.6673 1.7688 1.5181 2.5423 1.7544 2.2499 1.3386 1.0559 1.1124 1.6107 1.9208 1.8150 1.3649 1.7959 1.4006 1.3331 1.2971 1.3285 1.3347 1.6074 1.4339 4.7482 1.1847 2.1227 1.0893 1.0969 1.0591 1.0708 1.1206 1.0571 2.2158 5.9495 6.1650 1.0716 1.0691 1.0579 1.0826 1.0599 1.0613 1.0717 1.0855 1.0869 1.1032 1.1028 1.1010 1.0864 1.0865 1.0908 1.0958 1.1014
irintensity: 0.0005 0.3325 0.5562 1.5390 0.0077 0.8594 0.8035 1.4046 2.3646 0.8775 4.4392 0.0082 0.7416 2.9372 0.6161 13.2530 0.0781 1.4899 54.9175 8.8944 44.3583 0.4430 0.3332 0.0039 2.0965 0.5132 1.3870 0.5704 6.1183 5.7359 0.1809 26.9956 2.7897 4.0792 13.0811 14.8593 14.7743 3.0562 4.5133 14.8476 4.1024 0.0333 0.0732 0.1063 2.4663 9.3860 5.2064 21.0947 0.8159 0.5972 2.8490 0.4753 1.7681 1.5145 13.6275 0.3285 3.9786 6.4247 6.4445 12.4253 20.2409 4.6299 16.4744 7.8890 18.0877 1.7708 11.9892 50.2279 105.4140 211.7120 22.6041 21.7164 29.2294 43.3351 79.4938 34.9617 18.1968 53.5356 36.0887 9.7806 6.4384 12.4887 48.6388 26.3825
temp: 298.150 k
press: 1.00000 atm
elementType: 7 6 6 6 6 6 6 6 6 6 6 6 6 1 1 1 1 1 1 1 1 1 1 1 1 1 1 1 1 1
symmnumber: 1
zpe: 688146.2 jmol-1
zpe.correction: 0.262101 hartree
zpe.thermalcorrener: 0.273973 hartree
zpe.thermalcorrenthalpy: 0.274917 hartree
zpe.thermalcorrgfe: 0.223773 hartree
zpe.sumelectzpe: -521.228818 hartree
zpe.sumelectthermal: -521.216946 hartree
zpe.sumelectthermalent: -521.216002 hartree
zpe.sumelectthermalfe: -521.267146 hartree
dipole: 0.6585 -0.7224 0.2787
dipole: 1.0165
quadrupole: -73.4159 -76.7271 -80.7924
quadrupole: -1.6334 0.7781 -1.4852
quadrupole: 3.5625 0.2514 -3.8140 -1.6334 0.7781 -1.4852
hfenergy: -521.4909192 hartree
pointgroup: C01 [X(C12H17N1)]
dipole: -0.2585363 -0.2032676 0.2275218 debye
polarizability: 178.0760577|0.4889636|104.3730812|-0.1773105|-13.8751804|109.6805469 unknown
InChI: InChI=1S/C12H17N/c1-13-9-7-12(8-10-13)11-5-3-2-4-6-11/h2-6,12H,7-10H2,1H3
charge 0 multiplicity 1
30 atoms
N  -3.176301 0.242375 -0.238296
C  -0.333123 -0.338432 0.357062
C  -1.053094 -0.880438 -0.909123
C  -1.034592 0.974371 0.80799
C  -2.565439 -1.040508 -0.661103
C  -2.547279 0.754809 1.00198
C  1.167438 -0.153502 0.14955
C  -4.643612 0.147867 -0.12078
C  2.102105 -0.839108 0.967004
C  1.66894 0.714436 -0.857543
C  3.49431 -0.668106 0.788563
C  3.057995 0.888585 -1.040987
C  3.978536 0.197629 -0.218029
H  -0.478019 -1.085844 1.166832
H  -0.617925 -1.854184 -1.204864
H  -0.90319 -0.177604 -1.750491
H  -0.882533 1.757424 0.040949
H  -0.58586 1.339267 1.751668
H  -3.065868 -1.376935 -1.588794
H  -2.729017 -1.840547 0.112497
H  -2.709035 0.045997 1.860295
H  -3.035087 1.710573 1.271828
H  -5.075804 -0.169552 -1.086841
H  -5.062225 1.13848 0.132641
H  -4.979823 -0.579418 0.663095
H  1.73339 -1.512573 1.751314
H  0.96975 1.25892 -1.504139
H  4.197904 -1.208601 1.432343
H  3.4242 1.562441 -1.824279
H  5.056757 0.332579 -0.360044
