program: Gaussian 09
title: 000202396
version: EM64L-G09RevD.01
frameworkgroup: C1[X(C13H10BrNO)]
method: RPBEPBE
basis: SDD
operation: Freq
keyword: #p
keyword: freq=noraman
keyword: PBEPBE/SDD
title: #p freq=noraman PBEPBE/SDD
converged: NO YES NO NO
title: Mulliken charges:
elementType: Br O N C C C C C C C C C C C C C H H H H H H H H H H
charge: 0.000509 -0.260887 -0.479967 0.512754 0.251574 0.138460 -0.411490 -0.351207 -0.341532 -0.356594 -0.155406 -0.198621 -0.221404 -0.235990 -0.226763 -0.224607 0.316112 0.243789 0.315043 0.275156 0.218146 0.235347 0.235558 0.232890 0.253419 0.235710
chargesum: 0.00000
title: Mulliken charges with hydrogens summed into heavy atoms:
elementType: Br O N C C C C C C C C C C C C C
charge: 0.000509 -0.260887 -0.163855 0.512754 0.251574 0.138460 -0.167701 -0.036164 -0.066375 -0.138448 -0.155406 0.036725 0.014154 -0.003100 0.026656 0.011103
polarizability: 2.83788254e+02 3.96454654e+00 1.74453829e+02 7.85096984e+00 -5.19308843e+00 6.71327480e+01
1716.lowfreq: -11.4369 -5.1928 -2.4086 -0.0003 0.0003 0.0004 24.0539 42.0482 55.3183
frequency: 23.7892 42.0264 55.2944 78.9848 148.2911 162.1183 175.1201 200.6979 262.0335 291.5416 297.9653 378.8937 400.7943 416.1646 438.6634 478.1087 557.3659 576.4152 613.6245 642.2994 648.0275 684.7502 686.7698 689.5965 703.4043 789.1155 792.7677 845.7626 854.4674 864.9557 865.8268 918.6668 935.0034 975.9639 983.8433 989.6918 996.2383 1006.6116 1024.6648 1063.7549 1082.7828 1094.5007 1101.0209 1174.9746 1178.9569 1192.1970 1244.7215 1251.4760 1303.9641 1319.8631 1366.6348 1386.1439 1404.7071 1435.0568 1468.8001 1478.1560 1506.5595 1572.3667 1584.0156 1606.5445 1609.7882 1612.4255 3115.9048 3135.4938 3141.8022 3147.4846 3148.3855 3161.6005 3173.0561 3181.0289 3201.3561 3530.2512
redmass: 4.2870 5.3186 6.8994 7.2130 6.1601 5.6410 5.3005 7.1467 4.4401 5.8476 7.7758 7.0312 2.8066 4.3758 3.2566 4.8922 3.7781 6.4951 6.3023 1.7599 2.9862 3.2961 3.5886 4.5566 1.5247 2.0226 1.4849 3.5880 1.5182 2.2279 2.8809 1.3704 1.4496 5.8308 1.4388 5.1998 1.3174 1.3457 2.4911 2.4727 1.7327 1.8508 1.8534 1.0580 1.0873 1.1150 3.3490 1.7041 1.5154 1.3556 4.5518 8.9678 3.7101 2.2535 2.5835 2.2641 2.3097 7.8266 4.4174 6.0586 4.9687 6.5857 1.0881 1.0868 1.0924 1.0891 1.0919 1.0957 1.1007 1.0953 1.0955 1.0759
irintensity: 0.4082 1.1458 1.1536 4.4724 2.0544 2.2733 0.0775 3.6589 2.1119 11.0446 0.8904 2.6299 0.1549 2.5733 7.2067 4.5125 5.3066 27.6001 1.2748 31.9675 29.0969 36.2731 7.0744 2.4583 106.6523 47.7740 25.1828 26.8056 7.3257 26.9706 20.9571 5.1551 3.8914 19.0752 2.2264 0.8633 4.2146 1.7053 18.3324 42.3143 28.9286 17.6217 2.0844 1.5951 0.7571 13.4940 65.3370 79.0584 59.7373 6.4190 167.3395 1.5930 42.4997 10.3766 158.8002 52.2394 304.2853 186.8758 88.2263 78.7778 58.2203 16.1674 14.3632 0.8426 7.5370 8.6957 19.5280 14.8269 22.0746 3.6696 9.7830 10.8488
temp: 298.150 k
press: 1.00000 atm
elementType: 35 8 7 6 6 6 6 6 6 6 6 6 6 6 6 6 1 1 1 1 1 1 1 1 1 1
symmnumber: 1
zpe: 511236.7 jmol-1
zpe.correction: 0.194720 hartree
zpe.thermalcorrener: 0.208353 hartree
zpe.thermalcorrenthalpy: 0.209297 hartree
zpe.thermalcorrgfe: 0.151481 hartree
zpe.sumelectzpe: -643.728191 hartree
zpe.sumelectthermal: -643.714558 hartree
zpe.sumelectthermalent: -643.713614 hartree
zpe.sumelectthermalfe: -643.771431 hartree
dipole: -2.2220 -2.4509 -0.0889
dipole: 3.3094
quadrupole: -91.1032 -96.8555 -107.3617
quadrupole: 14.1313 2.8057 -1.8425
quadrupole: 7.3370 1.5846 -8.9216 14.1313 2.8057 -1.8425
hfenergy: -643.9229112 hartree
pointgroup: C01 [X(C13H10Br1N1O1)]
dipole: -1.0173242 -0.8110749 -0.0491546 debye
dipolederiv: -0.3916192 0.2850097 0.0317153 0.4101411 -0.4551997 -0.0476255 0.0451214 -0.046497 -0.0522549 -0.7973855 -0.1298244 0.0118724 0.3609386 -0.9085006 -0.0509015 0.0595306 -0.0174811 -0.3462092 -2.110124 0.2386392 0.0294882 0.4761408 -0.4138355 0.0115149 0.0754734 0.025321 -0.3055354 1.4435908 0.0109348 0.0179027 0.2598597 0.1227322 0.0024939 0.0090623 0.0028232 0.1211805 -0.3742848 -0.1046597 -0.009356 -0.1959555 -0.1096542 -0.0172767 -0.0428659 -0.0104175 -0.0124953 2.1736421 0.0068065 -0.047635 -0.8143355 1.1346142 0.0981498 -0.1212985 0.0340581 0.219264 -0.5504942 0.1048166 0.0078371 0.375787 -0.2063592 0.001797 0.0393548 -0.0038653 -0.1629097 -0.3962276 0.0084627 0.0017536 -0.2266851 -0.106015 0.0069511 -0.0279427 0.0006472 -0.1657466 -0.0484984 0.0907954 -0.0119086 -0.1042761 0.0401073 -0.0604991 -0.0049925 -0.023496 -0.1015355 -0.0391704 -0.0380695 0.0660295 0.1075663 -0.0233328 -0.0426217 0.107626 -0.0430881 -0.1128017 0.7194524 -0.4895916 -0.047106 -0.7939643 0.8592115 0.1122611 -0.0829522 0.1115066 -0.0861371 0.2522854 -0.0973185 -0.0062736 0.0913254 0.1604296 0.0369233 0.0198447 0.0319328 -0.1250441 0.0563779 -0.138454 0.0773728 -0.1491722 -0.0426759 -0.0535397 0.0829305 -0.0559649 -0.1178202 -0.1974081 0.0186112 -0.0092973 0.0863368 0.1074695 -0.0813345 -0.0421884 -0.0851192 -0.1189481 -0.3044112 0.2205074 0.0272009 0.209787 -0.3970228 -0.0326258 0.0226554 -0.0290078 -0.1354783 0.076549 0.069163 0.0192641 0.0101564 -0.0187661 -0.0340546 0.0306598 -0.0311109 -0.128567 0.2505778 0.0064306 -0.0047659 -0.0274273 0.0868155 -0.0252865 -0.0247942 -0.024664 0.2880114 0.0560487 -0.0798482 -0.0116904 -0.0855538 -0.0155187 -0.0265084 -0.0131143 -0.0221121 0.1668117 0.1863791 0.0588423 0.004527 0.0379995 0.0840901 -0.0127736 0.0088502 -0.0051098 0.1825202 0.1528294 -0.0418483 0.0069869 -0.0029686 0.0071544 0.0544733 0.029204 0.0384302 0.1422347 -0.0388072 0.0906979 -0.06611 0.1072847 0.0450478 0.0486557 -0.0839922 0.0399781 0.1159482 0.0314186 -0.0392804 -0.0083108 -0.0646296 -0.0814933 -0.0315236 -0.0117932 -0.0297328 0.1506897 -0.057706 0.075505 -0.0545859 0.0916905 0.0325642 0.0552183 -0.0626949 0.0544003 0.1308506 0.0644004 -0.0293311 -0.003666 -0.0677111 -0.0803223 0.0778673 0.0031605 0.0803681 0.1309299 -0.0562926 -0.022568 -0.007539 -0.0119042 0.1070352 -0.0087343 -0.004994 -0.0084715 0.1711713 -0.1011221 -0.0744285 -0.013706 -0.0804303 0.0714245 0.019 -0.0098505 0.0166724 0.1518709 unknown
polarizability: 282.3364445|-13.6752745|176.254405|4.9594836|-3.3586949|66.7839809 unknown
InChI: InChI=1S/C13H10BrNO/c14-11-7-4-8-12(9-11)15-13(16)10-5-2-1-3-6-10/h1-9,15H
charge 0 multiplicity 1
26 atoms
Br 5.05382 -2.278581 -0.254402
O  -0.748217 2.021199 0.070206
N  0.182484 -0.132427 -0.063601
C  1.574377 0.150629 -0.010382
C  -2.256915 0.122836 -0.003342
C  -0.892488 0.760787 0.011901
C  2.460531 -0.95641 -0.135666
C  2.099786 1.459613 0.165626
C  -3.344423 0.928435 -0.426576
C  -2.503751 -1.213355 0.412697
C  3.846424 -0.735612 -0.07948
C  3.49711 1.637426 0.219639
C  -4.652046 0.403026 -0.457997
C  -3.814532 -1.736603 0.384816
C  4.39381 0.55025 0.098959
C  -4.890372 -0.932784 -0.057583
H  -0.058441 -1.113705 -0.219596
H  2.069113 -1.970345 -0.272349
H  1.413867 2.303625 0.247993
H  -3.138465 1.963814 -0.715741
H  -1.694499 -1.84031 0.807713
H  3.901038 2.646159 0.356251
H  -5.484436 1.031651 -0.791523
H  -3.998359 -2.763523 0.718106
H  5.475366 0.700604 0.140568
H  -5.906582 -1.340999 -0.080335
