program: Gaussian 09
title: 000202393
version: EM64L-G09RevD.01
frameworkgroup: C1[X(C13H19NO)]
method: RPBEPBE
basis: SDD
operation: Freq
keyword: #p
keyword: freq=noraman
keyword: PBEPBE/SDD
title: #p freq=noraman PBEPBE/SDD
converged: YES YES NO NO
title: Mulliken charges:
elementType: O N C C C C C C C C C C C C C H H H H H H H H H H H H H H H H H H H
charge: -0.471565 -0.392595 0.277529 -0.196806 -0.505869 -0.455335 -0.401960 -0.387619 0.387686 -0.379333 -0.397221 -0.676307 -0.266455 -0.250417 -0.247590 0.240929 0.206860 0.220327 0.217674 0.198495 0.207642 0.194078 0.195045 0.202072 0.263724 0.339052 0.223784 0.308210 0.220225 0.229267 0.227044 0.221346 0.222152 0.225931
chargesum: 0.00000
title: Mulliken charges with hydrogens summed into heavy atoms:
elementType: O N C C C C C C C C C C C C C
charge: -0.132513 -0.128871 0.277529 0.044123 -0.078682 -0.039166 -0.000240 0.009498 0.387686 -0.155549 -0.089011 0.000230 -0.045109 -0.028266 -0.021659
polarizability: 1.82716541e+02 3.28933757e+00 1.40984100e+02 -6.66548068e+00 5.94881751e+00 1.09406105e+02
1716.lowfreq: -9.9671 -5.6915 0.0004 0.0008 0.0009 14.7747 20.6407 72.7364 82.2833
frequency: 18.6254 72.6492 82.2527 122.2042 152.4311 179.2313 195.2441 247.0516 253.8914 285.4608 300.2878 304.2958 351.2875 360.3918 398.5746 401.4864 419.6005 428.3562 507.4269 544.7003 590.7994 601.8016 618.7055 663.5002 706.9349 753.7595 772.2250 812.1410 825.1450 857.3971 877.2590 897.4212 912.2003 927.4064 959.0262 972.4241 981.4055 990.4362 1000.3215 1007.7630 1035.5631 1045.7729 1071.5192 1081.8276 1092.6854 1103.7377 1117.4433 1124.7110 1162.4341 1168.1114 1173.2689 1199.1286 1201.2318 1213.6608 1242.4909 1274.5590 1280.9554 1319.6863 1333.3958 1337.3112 1346.3955 1352.7973 1358.8258 1359.6535 1373.0945 1431.2338 1434.7446 1445.0097 1451.2368 1462.8525 1463.9636 1472.1777 1481.3869 1485.8088 1500.5750 1582.3715 1607.6004 2909.4461 2965.7779 2971.6416 2982.9959 2986.6832 3025.9518 3027.1781 3034.5155 3041.3098 3048.0166 3053.8468 3074.6417 3117.5959 3127.7334 3146.2977 3157.0333 3164.7901 3417.7278 3547.5326
redmass: 3.6365 2.8965 2.4181 2.9023 2.7854 2.8135 3.3548 1.4788 2.5170 3.2830 2.7815 3.3098 2.1683 1.5311 2.8180 2.8681 2.8517 3.7932 2.1639 3.1664 2.6506 3.1245 6.1931 4.6985 1.6668 1.8189 1.7767 1.5674 2.6451 1.2496 2.3455 2.4032 1.5295 1.4613 3.4086 2.1807 1.3871 4.9132 1.4528 2.0507 2.1668 1.8628 1.6629 2.1082 1.6127 1.5435 1.8361 1.7561 1.9259 2.7322 1.0701 1.5199 1.8025 1.4329 1.5457 1.3149 1.2899 1.3598 1.4512 1.3970 1.3864 1.4484 1.3185 1.5053 3.3110 1.9585 1.1734 1.2804 1.0969 1.0888 1.0894 1.0737 1.4038 1.3970 1.0450 5.7161 5.8369 1.0507 1.0639 1.0614 1.0602 1.0647 1.0814 1.0872 1.0976 1.0982 1.0971 1.1014 1.0998 1.0844 1.0891 1.0929 1.0949 1.0988 1.0733 1.0656
irintensity: 0.0940 8.7068 16.5519 11.2477 3.6697 0.8501 6.8551 5.9626 31.3911 9.2207 0.9532 0.3257 2.7731 122.4200 4.7114 0.0847 18.3464 1.2716 4.7446 24.0101 8.2761 11.5785 0.4197 15.5303 57.7832 48.7026 25.7701 30.6710 26.6612 0.6763 12.8983 15.6696 6.2223 8.1460 43.5899 12.2233 0.9634 2.7308 8.5143 25.8941 6.2853 0.7067 3.5043 9.4629 5.2490 6.0427 5.0799 14.7968 10.9370 6.3189 0.6424 18.2432 2.4695 14.6157 6.3216 3.2300 8.5719 3.0977 2.4445 0.8694 0.9688 1.4215 29.6105 1.8847 4.5492 4.7829 4.6433 14.9597 9.1914 11.6570 15.0322 4.5304 16.8205 20.6954 9.1954 1.4005 10.1519 74.7652 24.4652 38.0224 40.1114 19.4200 53.8136 13.2793 61.7466 41.8892 5.0158 96.4343 29.8500 0.7272 17.9281 35.8116 12.2877 29.9262 2.7446 4.1048
temp: 298.150 k
press: 1.00000 atm
elementType: 8 7 6 6 6 6 6 6 6 6 6 6 6 6 6 1 1 1 1 1 1 1 1 1 1 1 1 1 1 1 1 1 1 1
symmnumber: 1
zpe: 773645.7 jmol-1
zpe.correction: 0.294666 hartree
zpe.thermalcorrener: 0.309058 hartree
zpe.thermalcorrenthalpy: 0.310002 hartree
zpe.thermalcorrgfe: 0.253445 hartree
zpe.sumelectzpe: -635.588893 hartree
zpe.sumelectthermal: -635.574501 hartree
zpe.sumelectthermalent: -635.573557 hartree
zpe.sumelectthermalfe: -635.630114 hartree
dipole: -0.9921 -1.4391 0.4557
dipole: 1.8064
quadrupole: -86.6566 -90.8863 -89.2947
quadrupole: -0.9089 -0.0018 1.8068
quadrupole: 2.2893 -1.9404 -0.3488 -0.9089 -0.0018 1.8068
hfenergy: -635.8835593 hartree
pointgroup: C01 [X(C13H19N1O1)]
dipole: 0.4054408 -0.5186931 -0.2676873 debye
polarizability: 182.9383463|-1.1652992|141.9868453|-6.3067493|-0.5489414|108.1815543 unknown
InChI: InChI=1S/C13H19NO/c1-14-13(10-6-5-9-12(13)15)11-7-3-2-4-8-11/h2-4,7-8,12,14-15H,5-6,9-10H2,1H3
charge 0 multiplicity 1
34 atoms
O  0.893829 2.432075 -0.310537
N  0.845101 -0.061067 -1.594704
C  0.562776 -0.072365 -0.113456
C  1.264929 1.21577 0.460718
C  1.20473 -1.32217 0.563563
C  2.805972 1.135797 0.48711
C  2.744657 -1.37279 0.50567
C  3.34638 -0.127257 1.184975
C  -0.977494 -0.059617 0.14029
C  -1.715646 -1.268975 0.277279
C  -1.714807 1.160357 0.152014
C  0.539472 -1.286225 -2.36447
C  -3.12227 -1.264908 0.419933
C  -3.118656 1.165905 0.303461
C  -3.834736 -0.046189 0.434626
H  0.869802 1.405223 1.475716
H  0.794617 -2.243006 0.11183
H  0.882419 -1.327877 1.624276
H  3.186855 2.057124 0.967042
H  3.160939 1.127333 -0.564844
H  3.078381 -1.40892 -0.54968
H  3.099138 -2.299044 0.998115
H  3.071148 -0.117768 2.259752
H  4.451711 -0.141517 1.135095
H  0.348597 0.7470 -1.999277
H  1.512958 2.486232 -1.082927
H  -1.20034 -2.234438 0.291509
H  -1.179348 2.106731 0.034931
H  0.668282 -1.064551 -3.43899
H  -0.493278 -1.677008 -2.21497
H  1.252474 -2.090603 -2.11025
H  -3.657572 -2.216083 0.524093
H  -3.654568 2.122394 0.31719
H  -4.92465 -0.040268 0.549416
