program: Gaussian 09
title: 000202407
version: EM64L-G09RevD.01
frameworkgroup: C1[X(C14H12ClN3O2)]
method: RPBEPBE
basis: SDD
operation: Freq
keyword: #p
keyword: freq=noraman
keyword: PBEPBE/SDD
title: #p freq=noraman PBEPBE/SDD
converged: YES YES NO NO
title: Mulliken charges:
elementType: Cl O O N N N C C C C C C C C C C C C C C H H H H H H H H H H H H
charge: -0.073949 -0.383817 -0.250039 -0.305458 -0.028364 -0.684409 0.119900 0.060492 0.350205 0.057600 0.055576 0.378652 -0.531391 0.410352 -0.808728 -0.416270 -0.413355 -0.789670 -0.059601 0.069915 0.238118 0.278381 0.252512 0.222532 0.282956 0.238130 0.212793 0.271313 0.241423 0.315500 0.309759 0.378940
chargesum: 0.00000
title: Mulliken charges with hydrogens summed into heavy atoms:
elementType: Cl O O N N N C C C C C C C C C C C C C C
charge: -0.073949 -0.004877 -0.250039 -0.305458 -0.028364 -0.059150 0.119900 0.060492 0.350205 0.057600 0.055576 0.378652 -0.293273 0.410352 -0.055302 -0.133314 -0.175226 -0.064141 -0.059601 0.069915
polarizability: 3.33235796e+02 9.65078885e+00 2.20565173e+02 -5.80347560e+00 4.40183857e+00 8.94471939e+01
1716.lowfreq: -5.2009 -3.4710 -0.0008 0.0008 0.0010 1.9338 38.1017 46.4075 56.6851
frequency: 38.0995 46.3623 56.6806 66.8211 99.2721 121.1336 149.3533 189.0932 190.5611 218.5836 229.4429 234.4952 268.1854 271.9533 288.1862 297.9931 320.0458 328.4682 361.2716 393.8014 409.7170 428.5019 455.8569 490.9580 520.3609 532.5766 556.6309 566.7781 578.0612 583.0231 597.3316 620.6716 636.3461 643.4624 685.2269 711.4916 739.0967 768.6440 809.9116 811.5457 841.3012 849.6618 874.6351 951.2174 985.9876 1005.8195 1012.3074 1032.1187 1037.9994 1038.3228 1040.9019 1086.4333 1102.6152 1140.6948 1171.2186 1214.5788 1245.3876 1270.9959 1314.4378 1334.3978 1365.0756 1385.5546 1401.4510 1403.8800 1407.5587 1415.8921 1452.5535 1469.3108 1473.0482 1479.9877 1488.9104 1515.2346 1534.1824 1590.5850 1600.3394 1615.6850 1631.1582 1646.8076 2970.2062 2994.8969 3069.0577 3079.1484 3097.4630 3115.9538 3149.6375 3159.2857 3200.8898 3509.7698 3561.9052 3705.4345
redmass: 7.1570 5.5265 4.6108 5.8376 1.0951 6.9149 4.8706 5.4441 4.7137 4.0582 4.9801 2.4006 4.4215 1.6255 4.1667 3.7970 1.5593 3.7969 3.2664 3.1761 4.3830 1.3948 5.2253 3.5287 4.6562 2.2601 4.6580 5.1069 4.6803 3.2087 2.9868 2.7492 4.8661 5.0308 4.7745 7.2186 3.9017 8.4669 6.5900 1.6716 1.6034 1.2688 8.6376 2.5995 6.2359 4.8184 2.0012 1.8603 1.7411 1.5761 1.5472 2.7827 1.5514 3.6249 4.1248 1.9740 1.5017 2.0782 4.5492 5.3832 5.9747 3.2724 1.6919 1.2776 2.3963 3.6430 1.1045 1.2144 1.6496 1.7300 1.1726 6.5374 5.7223 7.7965 6.6500 8.2350 8.0329 1.1640 1.0469 1.0366 1.0861 1.0965 1.1009 1.1005 1.0917 1.0916 1.0942 1.0639 1.0467 1.1009
irintensity: 1.0400 0.4933 2.3559 1.8253 0.4462 1.1151 0.8733 2.3298 2.4993 1.7840 4.4280 18.0035 1.1215 14.3140 4.1237 1.1136 27.6280 4.1885 3.3910 72.5468 20.8198 170.6921 5.3239 3.9809 3.4988 45.3110 16.8164 5.8811 15.2475 17.9512 22.7133 53.7882 1.6842 4.9871 23.8020 6.9435 5.4048 3.2640 33.5860 21.9249 47.7030 12.9536 78.1804 1.3004 14.3912 106.5293 56.1447 40.9728 12.3324 18.0199 4.5608 86.5876 28.2347 56.8736 57.3255 24.2271 27.6448 37.1644 8.4284 45.1225 45.9448 18.6981 74.1505 8.8299 4.5151 71.7681 24.2192 5.0752 41.8602 25.1023 17.5090 128.5249 97.5265 375.6984 134.7423 218.6212 125.2959 138.5139 28.4271 19.0224 13.3058 8.3665 22.0727 4.5087 4.7786 8.4707 1.3105 36.5824 40.2008 26.9380
temp: 298.150 k
press: 1.00000 atm
elementType: 17 8 8 7 7 7 6 6 6 6 6 6 6 6 6 6 6 6 6 6 1 1 1 1 1 1 1 1 1 1 1 1
symmnumber: 1
zpe: 618217.5 jmol-1
zpe.correction: 0.235467 hartree
zpe.thermalcorrener: 0.253697 hartree
zpe.thermalcorrenthalpy: 0.254641 hartree
zpe.thermalcorrgfe: 0.189095 hartree
zpe.sumelectzpe: -1314.059098 hartree
zpe.sumelectthermal: -1314.040868 hartree
zpe.sumelectthermalent: -1314.039924 hartree
zpe.sumelectthermalfe: -1314.105470 hartree
dipole: 1.1281 7.2036 1.8826
dipole: 7.5305
quadrupole: -129.0336 -102.2517 -126.1365
quadrupole: -3.5857 0.7959 0.0667
quadrupole: -9.8930 16.8889 -6.9959 -3.5857 0.7959 0.0667
hfenergy: -1314.2945646 hartree
pointgroup: C01 [X(C14H12Cl1N3O2)]
dipole: -0.1756635 2.8668366 -0.7266785 debye
polarizability: 330.9268493|-18.2560874|222.8776603|7.2724526|-3.7904732|89.443653 unknown
InChI: InChI=1S/C14H12ClN3O2/c1-6-3-7(2)18-12-9(16)4-8(15)5-10(12)17-13(18)11(6)14(19)20/h3-5,19H,16H2,1-2H3
charge 0 multiplicity 1
32 atoms
Cl 5.270682 -1.926731 0.52947
O  -2.386081 -2.588146 -1.120398
O  -4.080295 -1.9257 0.31179
N  -0.045562 0.833791 -0.013741
N  0.016098 -1.49071 0.137062
N  2.744146 2.480947 -0.476111
C  1.335745 0.458523 0.047237
C  -0.790026 -0.427362 -0.015875
C  -0.733553 2.042809 0.131731
C  1.314661 -0.979942 0.191084
C  -2.222276 -0.401072 -0.132406
C  -2.903735 0.828465 -0.086689
C  -2.126629 2.020438 0.073667
C  2.587039 1.135987 -0.120107
C  -0.01711 3.339881 0.427332
C  2.494513 -1.744881 0.351671
C  3.763365 0.357543 0.064768
C  -4.41191 0.944457 -0.169263
C  3.693603 -1.029747 0.315816
C  -2.982633 -1.677721 -0.250033
H  -2.647962 2.975371 0.184726
H  0.870528 3.192883 1.062286
H  -0.711365 4.014931 0.9530
H  0.293605 3.872691 -0.493498
H  2.44387 -2.826633 0.479466
H  4.74161 0.838085 -0.039239
H  -4.717603 1.999169 -0.272312
H  -4.886967 0.52031 0.732608
H  -4.821996 0.376084 -1.022631
H  3.689001 2.827843 -0.62489
H  1.991427 2.999882 -0.913421
H  -2.91519 -3.432046 -1.112002
