program: Gaussian 09
title: 000202446
version: EM64L-G09RevD.01
frameworkgroup: C1[X(C21H27NO2)]
method: RPBEPBE
basis: SDD
operation: Freq
keyword: #p
keyword: freq=noraman
keyword: PBEPBE/SDD
title: #p freq=noraman PBEPBE/SDD
converged: YES YES NO NO
title: Mulliken charges:
elementType: O O N C C C C C C C C C C C C C C C C C C C C C H H H H H H H H H H H H H H H H H H H H H H H H H H H
charge: -0.329927 -0.449774 -0.071879 -0.368771 -0.350398 -0.389295 -0.398919 -0.398776 -0.325270 -0.421064 -0.293968 0.274352 0.346787 -0.387318 0.405346 -0.370860 -0.429612 -0.236919 -0.249523 -0.411490 -0.393451 -0.223485 -0.225744 -0.251197 0.209500 0.170518 0.170824 0.211851 0.191909 0.203090 0.204022 0.191658 0.190356 0.213286 0.198142 0.187438 0.229598 0.209474 0.202793 0.222026 0.246132 0.249161 0.239769 0.226163 0.229270 0.270374 0.245159 0.367935 0.222648 0.222406 0.225653
chargesum: 0.00000
title: Mulliken charges with hydrogens summed into heavy atoms:
elementType: O O N C C C C C C C C C C C C C C C C C C C C C
charge: -0.329927 -0.081838 -0.071879 0.011247 0.032278 0.005703 -0.003239 0.004865 0.060310 0.018009 0.130851 0.274352 0.346787 -0.141186 0.405346 -0.121699 -0.189844 -0.010756 -0.020254 -0.141115 -0.148292 -0.000837 -0.003338 -0.025544
polarizability: 2.87765115e+02 -3.06846316e+01 2.27062941e+02 -5.38016699e+00 2.92088197e-01 1.84238277e+02
1716.lowfreq: -5.8411 -1.5511 -0.0005 0.0004 0.0006 7.2384 12.3655 18.1142 26.1950
frequency: 12.2060 16.6374 26.0599 28.9796 33.9526 65.6279 71.5508 91.0356 115.4882 128.8971 154.4337 180.7887 196.5559 218.2612 235.7048 236.6570 246.4518 292.4232 306.4353 326.4734 359.8216 383.9808 392.2565 404.8381 405.6422 428.0461 448.1692 471.3362 476.0639 489.6901 535.2208 561.3131 564.5622 598.2202 611.0360 617.2705 644.8794 706.0355 722.5457 738.3779 745.7062 754.1485 756.3474 793.2276 804.6759 822.6775 846.0615 849.8828 855.1838 859.7954 860.6557 894.0309 913.9172 928.8960 932.5348 936.4691 958.2346 960.9523 975.3766 983.1566 989.3150 996.2805 998.7201 1027.2337 1033.1163 1042.6480 1048.1648 1055.5935 1078.9704 1101.0682 1104.9991 1106.4346 1114.3492 1123.7104 1150.9633 1156.9103 1165.7874 1170.0070 1174.6024 1180.4329 1184.6207 1197.6791 1216.5328 1223.2176 1229.5090 1245.1090 1255.8327 1260.4079 1265.2289 1286.6092 1295.8695 1299.7221 1313.1772 1322.9549 1331.1773 1341.0211 1347.9781 1352.1041 1360.3846 1373.7817 1379.1377 1388.7106 1394.1026 1395.6208 1433.0824 1440.1342 1448.7386 1450.8053 1459.3869 1463.5635 1466.2827 1471.7343 1472.7332 1477.7775 1482.0156 1489.3406 1591.3039 1595.4809 1605.9032 1611.8997 2817.0500 2827.9103 2856.9406 2956.6073 2968.1026 2984.4193 2986.1128 3002.3240 3002.8750 3013.3224 3020.6205 3026.4038 3033.0894 3042.7928 3045.3891 3054.7995 3068.3983 3117.7331 3121.8547 3125.5281 3135.5468 3139.0883 3150.8539 3156.0308 3161.9286 3169.3895 3454.2626
redmass: 3.2018 4.6711 4.0286 4.0687 3.9610 4.5175 3.9054 4.6694 3.6713 2.8300 4.4532 5.3007 3.4606 2.1697 3.3602 1.8329 4.4863 4.6451 2.2190 4.9148 2.5695 3.7597 2.2450 3.1324 3.1279 4.2736 2.8757 3.0053 3.0440 3.0800 1.3090 2.7103 2.7117 2.9311 5.6028 6.2287 4.2646 2.3327 2.0097 2.7017 2.1822 2.0756 1.7927 1.8709 1.5513 2.4521 2.0669 2.8235 1.4889 1.2664 2.0779 2.2749 2.7745 1.8283 1.5605 1.5650 1.3127 4.6073 1.3406 1.4579 4.7024 1.3317 2.4108 2.1497 2.7735 2.2165 2.0791 1.7779 1.5960 2.2500 1.7184 2.0680 2.2096 2.2055 1.3061 2.4810 1.4775 1.3047 1.1743 1.2373 1.2751 2.4498 1.6595 1.4767 1.2851 1.6914 1.5582 1.2898 1.1741 1.2661 1.2870 1.4225 1.3635 1.3062 1.3011 1.4267 1.4929 1.4440 1.3986 1.4132 5.0313 2.7305 1.7113 1.4733 2.2207 2.3354 1.0820 1.0914 1.0875 1.0889 1.0845 1.4193 1.1083 2.1734 1.0984 1.6930 6.3651 6.9123 6.4912 6.1692 1.0720 1.0702 1.0690 1.0573 1.0622 1.0615 1.0615 1.0686 1.0848 1.0842 1.0877 1.1009 1.0958 1.0898 1.1013 1.1034 1.1016 1.0842 1.0880 1.0878 1.0883 1.0930 1.0950 1.0933 1.1005 1.0997 1.0649
irintensity: 0.1171 0.1003 0.3125 0.2315 0.2954 1.3879 0.0589 0.5877 1.6748 0.2116 0.0463 1.0893 0.0892 0.9417 1.8569 1.5760 1.4005 0.2005 3.1109 1.8835 2.3119 2.6807 3.2893 0.5391 1.2079 0.5553 0.4246 6.1600 3.6245 19.0929 94.0330 18.9817 6.8498 55.6434 18.3574 3.8209 15.5189 25.7582 70.2189 5.5324 16.0906 48.6684 51.8101 5.0778 1.6504 4.2213 11.3034 3.8242 6.3020 0.9194 15.2104 1.5047 17.5836 12.0143 14.9294 14.8123 4.6702 67.1591 1.7578 0.5385 1.0280 0.6000 16.6967 6.4928 28.6221 10.7721 13.7384 15.6167 4.8711 4.1388 25.6328 16.0880 42.3029 6.1137 6.1580 33.2168 7.6363 12.1324 6.0956 7.3627 7.6333 88.8923 108.5178 27.5545 16.9152 7.5771 12.2947 3.1982 6.5436 2.0124 13.2616 4.9696 1.8622 3.7118 2.1875 0.6661 4.9967 2.5997 3.0794 10.6543 5.9583 32.6158 22.9164 2.4898 7.1522 36.3603 8.1967 7.3305 14.1835 6.8451 10.2883 60.6631 5.2074 22.5603 10.7501 17.5811 0.5734 11.9012 23.6894 14.8723 51.3504 78.0103 196.4260 41.4094 36.2298 37.4681 32.6134 13.8068 9.3272 19.4122 67.1276 39.2427 74.5458 36.8467 7.2255 97.1786 44.4754 1.7263 6.5545 5.7276 9.6757 25.0914 25.4267 29.2393 23.5444 18.0964 68.6667
temp: 298.150 k
press: 1.00000 atm
elementType: 8 8 7 6 6 6 6 6 6 6 6 6 6 6 6 6 6 6 6 6 6 6 6 6 1 1 1 1 1 1 1 1 1 1 1 1 1 1 1 1 1 1 1 1 1 1 1 1 1 1 1
symmnumber: 1
zpe: 1139175.1 jmol-1
zpe.correction: 0.433889 hartree
zpe.thermalcorrener: 0.456453 hartree
zpe.thermalcorrenthalpy: 0.457397 hartree
zpe.thermalcorrgfe: 0.378498 hartree
zpe.sumelectzpe: -1019.811611 hartree
zpe.sumelectthermal: -1019.789047 hartree
zpe.sumelectthermalent: -1019.788103 hartree
zpe.sumelectthermalfe: -1019.867001 hartree
dipole: -0.3394 -1.4986 -2.5768
dipole: 3.0002
quadrupole: -131.6394 -136.5323 -148.2504
quadrupole: -4.0081 -5.7431 2.5696
quadrupole: 7.1680 2.2750 -9.4430 -4.0081 -5.7431 2.5696
hfenergy: -1020.2454995 hartree
pointgroup: C01 [X(C21H27N1O2)]
dipole: 0.2689149 0.6702673 -0.933633 debye
polarizability: 281.6770269|-35.27045|231.499642|11.7066442|0.2647892|185.8896643 unknown
InChI: InChI=1S/C21H27NO2/c23-21(18-10-3-1-4-11-18)19-12-5-6-13-20(19)24-17-9-16-22-14-7-2-8-15-22/h1,3-6,10-13,21,23H,2,7-9,14-17H2
charge 0 multiplicity 1
51 atoms
O  -0.722295 1.279529 -0.305787
O  -1.120727 -0.13801 2.037951
N  3.598677 0.80368 0.094167
C  4.501985 1.272792 1.179124
C  3.512212 -0.681746 0.083622
C  5.924569 0.706031 0.997787
C  4.900664 -1.317516 -0.131431
C  5.896778 -0.83894 0.949309
C  2.265476 1.449894 0.15786
C  1.52839 1.405562 -1.198086
C  0.159141 2.087358 -1.176307
C  -2.098074 1.577825 -0.257792
C  -2.88671 0.657593 0.492783
C  -2.233052 -0.550463 1.161131
C  -1.794115 -1.644983 0.166514
C  -2.680754 2.703507 -0.881175
C  -4.269561 0.908185 0.607516
C  -4.073462 2.921142 -0.758897
C  -4.872591 2.027949 -0.014859
C  -0.669103 -2.451784 0.469251
C  -2.520689 -1.900188 -1.023228
C  -0.271763 -3.487482 -0.405696
C  -2.125707 -2.938468 -1.897663
C  -0.99836 -3.735794 -1.593592
H  4.529118 2.378553 1.154181
H  4.114582 0.970045 2.188824
H  3.078769 -1.0568 1.050145
H  2.825869 -0.997787 -0.721832
H  6.569437 1.05979 1.825366
H  6.344649 1.098929 0.051611
H  5.272506 -1.028394 -1.133366
H  4.805238 -2.420429 -0.113679
H  5.581262 -1.231521 1.938369
H  6.908869 -1.239567 0.750538
H  2.415531 2.510025 0.443002
H  1.624192 0.991164 0.95356
H  1.386601 0.362116 -1.53368
H  2.161247 1.908597 -1.95424
H  0.220323 3.12035 -0.77349
H  -0.277447 2.122603 -2.194134
H  -2.963422 -0.990631 1.865761
H  -2.070223 3.411985 -1.448482
H  -4.883408 0.214059 1.194485
H  -4.52508 3.79507 -1.241313
H  -5.949031 2.200279 0.085528
H  -0.116691 -2.253886 1.393725
H  -3.390507 -1.28116 -1.27207
H  -0.486965 0.365251 1.455081
H  0.6009 -4.103702 -0.158715
H  -2.695704 -3.122394 -2.815879
H  -0.691147 -4.539618 -2.272396
