program: Gaussian 09
title: 000202383
version: EM64L-G09RevD.01
frameworkgroup: C1[X(C15H21NO3)]
method: RPBEPBE
basis: SDD
operation: Freq
keyword: #p
keyword: freq=noraman
keyword: PBEPBE/SDD
title: #p freq=noraman PBEPBE/SDD
converged: YES YES NO NO
title: Mulliken charges:
elementType: O O O N C C C C C C C C C C C C C C C H H H H H H H H H H H H H H H H H H H H H
charge: -0.272076 -0.271431 -0.263023 -0.083302 -0.366334 -0.371893 -0.389978 -0.384814 -0.399296 -0.377297 -0.295946 0.371440 0.272625 -0.511641 0.194026 -0.383747 -0.333545 -0.313833 -0.317156 0.177127 0.206745 0.213030 0.168580 0.192038 0.204907 0.203897 0.192286 0.214537 0.189623 0.205752 0.219830 0.220059 0.208922 0.272756 0.251355 0.225005 0.229381 0.226023 0.226969 0.248402
chargesum: 0.00000
title: Mulliken charges with hydrogens summed into heavy atoms:
elementType: O O O N C C C C C C C C C C C C C C C
charge: -0.272076 -0.271431 -0.263023 -0.083302 0.017538 0.009717 0.006966 0.011369 0.004864 0.048284 0.133035 0.371440 0.272625 -0.238885 0.194026 -0.132392 -0.085144 0.140553 0.135835
polarizability: 2.48767224e+02 1.05605150e+01 1.73709494e+02 -1.74909632e+00 4.13043614e+00 1.20542215e+02
1716.lowfreq: -9.4864 0.0004 0.0005 0.0009 5.2673 11.5889 25.3299 28.1260 40.2152
frequency: 25.1048 27.6828 39.5743 69.6760 102.0536 107.0504 133.2915 156.5277 187.7050 210.0218 226.9158 242.8208 291.7959 308.9726 330.1901 368.2348 372.7084 395.8816 419.1966 449.9613 451.7157 454.5582 479.1940 500.1343 530.5456 567.4083 604.6197 623.8187 703.2336 712.5371 733.0289 766.2100 802.6461 806.0391 815.4955 848.1689 851.7455 854.2965 858.3546 876.7452 907.6059 931.8444 936.1067 957.4721 984.0293 996.2692 1018.2121 1033.9406 1044.6126 1050.7881 1085.1295 1086.6767 1095.7916 1100.8751 1112.9943 1125.8530 1141.8788 1149.5099 1161.3978 1175.6795 1178.6675 1205.0116 1244.4232 1252.0934 1259.2194 1260.7774 1265.2691 1274.7678 1289.3950 1294.3794 1322.4844 1332.0549 1340.9745 1348.1441 1349.8174 1352.8230 1356.6031 1371.3800 1386.8290 1400.5644 1424.0496 1451.9376 1454.8958 1459.7988 1459.8273 1462.5039 1467.6921 1470.4202 1477.8448 1481.8964 1491.2751 1591.6573 1624.9560 2821.8926 2832.3994 2905.1521 2962.8716 2965.9585 2984.9033 2985.9182 2992.0432 3002.3959 3023.1899 3023.8046 3027.0314 3034.7945 3045.7171 3054.0248 3054.9638 3095.9859 3098.0834 3156.7418 3177.7324 3180.2063
redmass: 3.2222 4.5958 4.3537 4.0432 3.7988 3.8309 2.2403 3.6746 5.0710 2.9500 4.9489 1.9148 2.8490 2.4219 2.6144 5.4629 2.1519 2.7454 4.6168 3.2736 3.0256 4.3033 3.3951 4.3182 3.4896 2.4861 4.1063 2.8871 3.4198 5.7870 4.5352 3.6590 1.4441 1.4275 1.2730 1.8235 2.1890 1.6215 2.8385 3.2080 2.2060 3.1846 1.3546 1.3023 5.0614 2.4796 3.0750 3.3353 1.9326 1.8848 2.6476 1.9693 2.4766 1.5985 1.9459 2.1460 1.6715 1.3710 2.1731 1.5626 1.5634 1.1688 1.3273 1.6709 1.4794 1.2869 1.1864 2.7205 1.2435 1.4031 1.3483 1.3204 1.4243 1.4583 1.4233 1.3086 1.4151 1.4432 4.0846 1.5716 3.8799 1.0921 1.1201 1.1323 1.0943 1.0845 1.0890 1.1450 1.2005 1.1985 1.7738 8.6345 7.2342 1.0717 1.0700 1.0694 1.0564 1.0627 1.0612 1.0618 1.0676 1.0613 1.0866 1.0982 1.0929 1.0943 1.1034 1.0971 1.1031 1.0982 1.1042 1.0880 1.0925 1.0952
irintensity: 0.7370 0.0412 0.2938 2.2379 4.1283 1.9204 0.5493 7.0722 0.5842 1.2275 2.3934 0.2057 3.7716 6.8486 3.0494 2.0102 6.6199 6.9061 4.1012 2.1176 3.4586 1.1542 1.8836 4.2899 1.5555 0.2655 7.3416 5.2601 1.3499 3.3984 32.0596 8.9742 0.3408 26.4410 19.6619 20.0690 23.0372 3.8830 23.8670 29.5843 1.2561 12.9837 0.6244 2.7531 103.1860 38.1589 7.5336 100.8568 14.1341 15.4462 20.5640 0.0546 14.5903 11.1344 21.4307 3.8950 78.9208 6.0239 42.9953 195.0876 113.9439 12.7913 27.7085 8.3106 30.5768 4.3709 7.2978 49.7226 6.1199 12.5152 30.2013 2.1056 0.6788 14.7374 6.6010 15.7516 0.4602 5.0432 19.2783 4.4903 8.7957 7.1937 11.5582 13.8883 14.2813 1.1105 8.2187 82.4115 80.3223 90.3064 146.1873 46.7271 57.4927 46.3539 166.5023 73.2997 39.2656 39.3598 34.8175 28.6086 61.4071 53.3020 65.9539 25.9499 42.3630 32.2824 21.8603 49.3076 109.5670 39.9122 19.8060 5.1148 5.0708 2.8804
temp: 298.150 k
press: 1.00000 atm
elementType: 8 8 8 7 6 6 6 6 6 6 6 6 6 6 6 6 6 6 6 1 1 1 1 1 1 1 1 1 1 1 1 1 1 1 1 1 1 1 1 1
symmnumber: 1
zpe: 886628.9 jmol-1
zpe.correction: 0.337699 hartree
zpe.thermalcorrener: 0.355167 hartree
zpe.thermalcorrenthalpy: 0.356111 hartree
zpe.thermalcorrgfe: 0.290760 hartree
zpe.sumelectzpe: -863.114545 hartree
zpe.sumelectthermal: -863.097077 hartree
zpe.sumelectthermalent: -863.096133 hartree
zpe.sumelectthermalfe: -863.161484 hartree
dipole: -0.3940 1.8414 0.0884
dipole: 1.8851
quadrupole: -92.4081 -110.9798 -114.4877
quadrupole: 11.9885 2.9300 -1.0321
quadrupole: 13.5504 -5.0212 -8.5292 11.9885 2.9300 -1.0321
hfenergy: -863.4522443 hartree
pointgroup: C01 [X(C15H21N1O3)]
dipole: -0.1589492 0.7189472 0.088946 debye
polarizability: 248.6637233|11.0133655|172.8894799|-0.5012566|8.1363501|121.4657302 unknown
InChI: InChI=1S/C15H21NO3/c1-2-6-16(7-3-1)8-9-17-13-4-5-14-15(12-13)19-11-10-18-14/h4-5,12H,1-3,6-11H2
charge 0 multiplicity 1
40 atoms
O  -0.184446 -1.466463 -0.201207
O  3.31816 1.895232 0.466282
O  5.315776 -0.182532 -0.08923
N  -3.671578 -0.193429 0.170034
C  -4.045638 0.474475 -1.103042
C  -4.861564 -0.744542 0.866243
C  -5.036339 1.629315 -0.854106
C  -5.877124 0.373171 1.181184
C  -6.290669 1.119743 -0.107901
C  -2.570382 -1.170499 0.003931
C  -1.214184 -0.45717 0.096855
C  1.158927 -1.056513 -0.158627
C  2.954571 0.560204 0.16346
C  1.576081 0.258346 0.150882
C  3.918923 -0.441928 -0.11516
C  2.116837 -2.059694 -0.460069
C  3.487634 -1.747353 -0.432364
C  4.727559 2.200453 0.137203
C  5.640496 1.069616 0.623133
H  -4.508498 -0.259832 -1.815593
H  -3.129693 0.861009 -1.587171
H  -4.524574 -1.225291 1.803489
H  -5.368531 -1.533888 0.248975
H  -5.317171 2.087955 -1.821874
H  -4.533006 2.406214 -0.246787
H  -5.409226 1.086313 1.887154
H  -6.762692 -0.06457 1.68109
H  -6.96823 1.960954 0.131919
H  -6.85487 0.428261 -0.768039
H  -2.625805 -1.724089 -0.963238
H  -2.626542 -1.924523 0.809791
H  -1.069116 -0.044722 1.114638
H  -1.147975 0.373515 -0.635541
H  0.873112 1.064538 0.374742
H  1.769366 -3.067316 -0.703273
H  4.949186 3.151582 0.64763
H  4.82651 2.329276 -0.958276
H  6.698176 1.27677 0.39389
H  5.514682 0.917315 1.713377
H  4.243561 -2.5086 -0.648204
