program: Gaussian 09
title: 000202417
version: EM64L-G09RevD.01
frameworkgroup: C1[X(C18H19N3O5)]
method: RPBEPBE
basis: SDD
operation: Freq
keyword: #p
keyword: freq=noraman
keyword: PBEPBE/SDD
title: #p freq=noraman PBEPBE/SDD
converged: YES YES NO NO
title: Mulliken charges:
elementType: O O O O O N N N C C C C C C C C C C C C C C C C C C H H H H H H H H H H H H H H H H H H H
charge: -0.253884 -0.226453 -0.236584 -0.201194 -0.197383 -0.149119 -0.067038 -0.262635 -0.136453 -0.449079 -0.497853 -0.402955 0.216153 0.205294 -0.353725 -0.349765 0.085082 0.120795 -0.306958 -0.311860 0.179790 0.192934 -0.352815 -0.353050 -0.210295 -0.209730 0.283644 0.237910 0.270436 0.240948 0.261221 0.251626 0.248996 0.200550 0.244995 0.248935 0.200125 0.192289 0.211147 0.210037 0.203404 0.270465 0.270817 0.240563 0.240671
chargesum: 0.00000
title: Mulliken charges with hydrogens summed into heavy atoms:
elementType: O O O O O N N N C C C C C C C C C C C C C C C C C C
charge: -0.253884 -0.226453 -0.236584 -0.201194 -0.197383 -0.149119 -0.067038 -0.262635 0.147191 0.059267 0.004316 0.097667 0.216153 0.205294 0.091819 0.099296 0.085082 0.120795 0.096478 0.101582 0.179790 0.192934 -0.082351 -0.082233 0.030268 0.030942
polarizability: 2.92909627e+02 2.62388139e+01 2.29071595e+02 2.55309875e+01 -9.09045166e+00 1.58114452e+02
1716.lowfreq: -3.5423 -0.0005 0.0006 0.0007 6.7730 9.1303 11.0796 20.9725 33.5482
frequency: 9.5402 20.6949 33.5112 38.6366 51.7720 69.4805 86.0268 112.8279 128.3983 142.6904 147.7512 182.9594 205.0174 210.4169 219.3118 237.5989 244.2333 261.6266 296.1415 338.3320 359.1539 381.6179 390.0780 407.2946 417.2268 426.4656 448.9856 455.3445 460.7052 473.1408 522.8933 530.0589 562.4861 581.4512 598.0645 599.3547 658.6970 662.3793 670.3383 682.9931 706.1820 718.6309 754.3621 772.2739 788.6939 797.6833 801.0238 842.1266 848.6734 855.9372 873.4303 887.6150 908.2442 920.1028 975.9726 984.3801 996.6477 1003.4836 1007.8831 1014.7601 1025.8336 1034.0211 1053.7158 1058.7409 1072.5722 1081.6921 1091.6885 1096.6844 1101.2977 1157.9051 1166.3369 1169.9323 1172.8452 1175.2499 1193.7313 1210.3062 1214.6103 1240.8030 1270.3394 1276.8289 1284.5443 1292.7680 1304.4661 1324.6257 1329.2349 1331.6982 1337.0088 1339.6142 1351.1912 1364.0338 1365.2326 1374.6596 1386.3370 1401.5195 1416.9587 1443.8217 1448.5556 1449.3230 1452.8141 1453.9365 1454.7748 1458.4890 1466.5260 1480.4132 1581.3971 1614.5789 1618.4739 1626.3022 1630.8035 1678.7292 2885.9372 2891.3722 2954.8373 2959.9884 2969.8530 2986.2001 3023.5758 3031.0011 3052.8390 3058.8470 3079.0452 3082.3778 3082.6264 3089.4567 3096.3557 3140.8989 3154.5598 3166.2019 3175.7734
redmass: 5.9340 6.0147 4.9307 5.2151 6.1678 5.3201 5.3834 5.3525 6.6583 5.4540 6.7572 7.0679 3.9575 2.8108 4.6042 3.1120 6.2709 2.1918 6.6237 10.3053 6.2926 2.1053 3.0078 4.5352 3.3006 2.7396 7.1513 4.8666 4.0954 2.4284 7.0973 7.5825 4.5883 2.5585 5.5656 2.9360 4.8229 5.0937 5.2041 6.6643 3.9790 3.1764 4.6429 4.3466 5.2196 1.7179 3.8956 1.7359 2.6836 2.6964 4.0919 3.0725 1.4011 2.7725 1.4130 2.7269 2.6454 2.4831 1.3497 2.1698 2.3662 2.7620 2.8718 2.1685 2.6193 3.6011 2.9585 2.4053 2.1981 2.6622 1.9677 1.2415 1.9194 1.5200 1.0894 2.3006 1.9350 1.3867 2.3725 1.2717 1.4985 2.1257 1.5590 1.3854 1.4933 1.3303 1.5363 1.2797 6.4815 1.5535 1.3482 1.5390 1.4225 1.2706 6.1770 1.0850 1.0837 1.0944 1.1323 2.6452 2.4753 1.0795 1.1055 1.0854 11.6592 7.7064 7.8857 10.2402 11.5699 12.3395 1.0700 1.0696 1.0661 1.0661 1.0812 1.0679 1.0603 1.0585 1.0908 1.0914 1.0969 1.0967 1.0983 1.1022 1.1070 1.0866 1.0907 1.0957 1.1004
irintensity: 0.1016 0.2048 1.0684 0.0564 0.8864 1.4102 6.1994 2.8618 5.1250 0.3986 1.0937 1.4193 3.2250 2.7472 2.4505 13.6793 1.9679 0.1917 7.4447 18.4342 1.5757 5.9827 2.3971 20.7723 7.7099 6.5198 3.3531 0.0573 18.3017 1.0535 8.8593 16.4554 7.0364 5.0558 34.6846 12.9249 0.2054 9.1240 9.4957 1.7660 39.5777 44.7838 3.1577 10.1260 0.2551 30.2759 12.2631 2.4095 11.0752 21.1900 17.1721 6.0997 0.0100 17.4819 2.1108 24.3861 108.2002 36.2161 0.0262 6.8365 41.0080 38.4868 13.5028 27.3680 15.6444 93.3250 4.5601 23.4989 18.0645 132.4767 140.8770 3.0142 18.1167 8.0162 10.3960 32.6300 1.6255 29.2897 165.9430 2.1399 0.9041 153.3694 45.9097 12.1748 25.0794 20.7281 6.5939 1.9439 390.1277 17.4006 1.9796 4.7915 16.2397 22.1626 10.8857 2.7730 13.3581 2.1263 30.0075 0.9478 11.9730 6.4232 14.9176 12.9717 422.3786 5.4576 67.4592 45.8116 370.1402 58.5880 51.0336 158.6655 43.3646 86.3832 22.9052 10.6199 19.2015 30.8562 10.0366 7.7328 45.4376 26.0956 31.2159 6.3898 1.2612 1.6796 5.3043 5.0390 20.8610
temp: 298.150 k
press: 1.00000 atm
elementType: 8 8 8 8 8 7 7 7 6 6 6 6 6 6 6 6 6 6 6 6 6 6 6 6 6 6 1 1 1 1 1 1 1 1 1 1 1 1 1 1 1 1 1 1 1
symmnumber: 1
zpe: 924674.6 jmol-1
zpe.correction: 0.352190 hartree
zpe.thermalcorrener: 0.374551 hartree
zpe.thermalcorrenthalpy: 0.375496 hartree
zpe.thermalcorrgfe: 0.297737 hartree
zpe.sumelectzpe: -1235.822535 hartree
zpe.sumelectthermal: -1235.800174 hartree
zpe.sumelectthermalent: -1235.799230 hartree
zpe.sumelectthermalfe: -1235.876988 hartree
dipole: 4.7817 -0.5119 -0.8688
dipole: 4.8869
quadrupole: -139.6800 -152.8811 -152.0980
quadrupole: 18.6911 -7.7802 4.8969
quadrupole: 8.5397 -4.6614 -3.8783 18.6911 -7.7802 4.8969
hfenergy: -1236.1747254 hartree
pointgroup: C01 [X(C18H19N3O5)]
dipole: 1.9026967 0.1961657 0.1944775 debye
polarizability: 287.7658388|-23.3114556|229.4815796|-38.9575413|-1.2560974|162.8482559 unknown
InChI: InChI=1S/C18H19N3O5/c22-15-6-5-14(18(25)20(15)11-19-7-9-26-10-8-19)21-16(23)12-3-1-2-4-13(12)17(21)24/h1-4,14H,5-11H2
charge 0 multiplicity 1
45 atoms
O  -4.564588 -3.011977 0.569097
O  -0.387172 0.17999 -1.564309
O  -3.499654 2.449751 1.06133
O  3.060481 2.37479 -1.143749
O  0.933369 -1.137813 1.159226
N  -1.933472 1.35592 -0.27306
N  -3.524456 -0.534331 -0.441284
N  1.733907 0.827364 0.07907
C  0.532778 1.653681 0.171855
C  0.120037 1.974075 1.623198
C  -1.148853 2.844595 1.597977
C  -3.075856 0.693904 -1.043986
C  -0.616529 0.987746 -0.625628
C  -2.287713 2.214173 0.803897
C  -4.862754 -0.573009 0.182076
C  -3.117542 -1.813927 -1.058031
C  2.906373 1.242167 -0.624786
C  1.829857 -0.522539 0.531198
C  -4.915542 -1.726846 1.200122
C  -3.208713 -2.934616 -0.007885
C  3.834389 0.070651 -0.580371
C  3.190471 -0.98548 0.110558
C  5.128939 -0.075304 -1.10058
C  3.820819 -2.223309 0.304729
C  5.774754 -1.32462 -0.910184
C  5.130604 -2.381895 -0.218513
H  0.789014 2.598888 -0.353494
H  0.942018 2.510184 2.128558
H  -0.06315 1.03406 2.172139
H  -0.929368 3.833624 1.146113
H  -1.5337 3.037866 2.612577
H  -2.674515 0.534349 -2.059286
H  -3.880519 1.446988 -1.063204
H  -5.663309 -0.730411 -0.580677
H  -5.048267 0.387206 0.69582
H  -2.078834 -1.726471 -1.422367
H  -3.775428 -2.074127 -1.92234
H  -4.210428 -1.515617 2.033076
H  -5.934835 -1.863841 1.598082
H  -3.02637 -3.923743 -0.459786
H  -2.467431 -2.74522 0.798097
H  5.614747 0.746795 -1.635137
H  3.313799 -3.033662 0.837542
H  6.785042 -1.477803 -1.304156
H  5.653402 -3.335504 -0.089227
