program: Gaussian 09
title: 000202376
version: EM64L-G09RevD.01
frameworkgroup: C1[X(C14H15NO2)]
method: RPBEPBE
basis: SDD
operation: Freq
keyword: #p
keyword: freq=noraman
keyword: PBEPBE/SDD
title: #p freq=noraman PBEPBE/SDD
converged: YES YES NO NO
title: Mulliken charges:
elementType: O O N C C C C C C C C C C C C C C H H H H H H H H H H H H H H H
charge: -0.223734 -0.224015 -0.178457 -0.277600 -0.531694 -0.531548 0.555181 0.199562 0.185405 -0.442826 -0.389122 -0.458398 -0.250231 -0.218605 -0.023524 -0.240879 -0.556853 0.240348 0.245250 0.271400 0.272309 0.244298 0.251152 0.241626 0.224196 0.235140 0.227860 0.229340 0.247629 0.232506 0.215510 0.228776
chargesum: 0.00000
title: Mulliken charges with hydrogens summed into heavy atoms:
elementType: O O N C C C C C C C C C C C C C C
charge: -0.223734 -0.224015 -0.178457 -0.037252 -0.015044 -0.014942 0.555181 0.199562 0.185405 0.049951 -0.164926 -0.223258 -0.022371 0.010735 0.224106 -0.008373 -0.112567
polarizability: 2.15967209e+02 6.70791767e+00 1.28986476e+02 -3.55899624e+00 -1.23404699e+00 1.30355616e+02
1716.lowfreq: -6.9368 -0.0009 -0.0005 0.0007 6.1904 12.6336 31.6333 38.2620 46.7467
frequency: 31.5256 38.2402 46.6959 70.0157 78.5919 93.9323 102.6090 162.1456 203.3143 256.2810 274.1262 306.0209 341.9744 390.8108 404.2472 422.1738 440.0051 475.9638 502.2584 520.5214 586.2826 590.5451 609.4017 616.4689 632.2141 648.9113 706.4760 759.4043 772.8613 849.9356 850.9744 867.5827 877.3515 919.2156 921.0625 931.6182 961.6235 974.8343 990.6388 996.7359 1006.8693 1011.6871 1017.0182 1027.7896 1069.4734 1086.4455 1111.7022 1129.9109 1158.7952 1173.7379 1190.5051 1207.6150 1219.4526 1237.1201 1267.1385 1274.9243 1285.0018 1301.7216 1321.3334 1329.5040 1335.9688 1355.3070 1361.5492 1388.9363 1426.6886 1438.8810 1443.7084 1445.5806 1449.2922 1484.4058 1586.4038 1594.2221 1613.8719 1629.8319 1661.2211 2983.1054 2990.2390 3002.0529 3037.1991 3079.0087 3083.0949 3090.9025 3107.5207 3111.2724 3118.6056 3124.3229 3134.2428 3146.0709 3164.8570 3201.0809
redmass: 3.9436 4.6140 4.4188 2.9027 4.2311 2.7970 6.0394 3.1320 5.5976 4.2298 2.9643 4.2377 4.8466 2.3096 2.8072 3.3921 3.1910 2.9734 3.6210 3.4938 3.5766 3.2798 3.5283 6.3850 2.8182 4.6961 1.6668 3.2391 1.9660 2.5659 1.5217 1.6239 1.8287 1.4405 2.5907 2.1805 1.3327 1.3898 6.2714 1.3195 1.9594 1.9785 1.7750 2.2668 3.2613 1.6877 3.5556 1.6234 1.7634 1.0568 1.1122 1.8891 2.2977 1.5547 1.5129 1.3077 1.2491 2.5841 1.4370 1.3456 1.6716 1.4274 1.8049 4.0484 1.1617 1.0808 1.1360 2.0030 1.1048 2.2973 11.2513 5.9485 6.1434 10.0064 4.6386 1.0744 1.0659 1.0751 1.0604 1.0944 1.0957 1.0601 1.0983 1.0877 1.0873 1.0992 1.0900 1.0955 1.1014 1.1149
irintensity: 0.0758 0.2762 0.1890 0.0565 0.0132 0.3594 9.5771 0.7988 0.8687 0.9241 3.7206 5.4953 16.9600 2.2626 0.0022 9.9797 1.5426 4.9187 25.2757 3.0473 1.8467 15.0645 6.7118 0.2735 11.9790 3.8625 49.1021 11.3008 55.4801 3.8106 1.2400 0.4276 13.5225 3.5121 9.0908 8.2085 78.8201 0.0557 0.4019 0.1032 6.1588 5.2145 21.9305 7.4630 4.8269 6.5809 13.2337 90.6682 9.0440 0.0476 0.1990 0.5647 120.9850 9.9624 44.6716 0.7849 5.6014 150.0332 8.0527 16.8303 93.0205 29.7111 23.1700 0.3134 12.4563 4.5794 50.0282 13.3958 6.5153 17.6082 389.6178 1.8006 6.7035 76.7469 6.6243 0.6800 3.9240 23.9777 15.6848 6.8894 5.3584 6.1249 3.1969 16.3393 7.5320 4.7464 6.8125 36.5238 23.3296 21.2240
temp: 298.150 k
press: 1.00000 atm
elementType: 8 8 7 6 6 6 6 6 6 6 6 6 6 6 6 6 6 1 1 1 1 1 1 1 1 1 1 1 1 1 1 1
symmnumber: 1
zpe: 677342.2 jmol-1
zpe.correction: 0.257986 hartree
zpe.thermalcorrener: 0.273449 hartree
zpe.thermalcorrenthalpy: 0.274393 hartree
zpe.thermalcorrgfe: 0.213352 hartree
zpe.sumelectzpe: -746.460924 hartree
zpe.sumelectthermal: -746.445462 hartree
zpe.sumelectthermalent: -746.444517 hartree
zpe.sumelectthermalfe: -746.505559 hartree
dipole: 3.1079 -0.1620 0.5274
dipole: 3.1565
quadrupole: -93.7930 -117.5425 -91.4130
quadrupole: 0.6753 -1.8759 -0.9958
quadrupole: 7.1231 -16.6263 9.5032 0.6753 -1.8759 -0.9958
hfenergy: -746.7189104 hartree
pointgroup: C01 [X(C14H15N1O2)]
dipole: -1.2229833 -0.0057418 -0.2155409 debye
polarizability: 215.9998029|-4.9845658|128.3675128|-5.4726337|0.6228684|130.9419857 unknown
InChI: InChI=1S/C14H15NO2/c1-2-8-15-13(16)9-12(10-14(15)17)11-6-4-3-5-7-11/h2-7,12H,1,8-10H2
charge 0 multiplicity 1
32 atoms
O  2.205769 -2.265892 -0.130511
O  2.082437 2.279245 0.896656
N  2.127569 0.000922 0.421367
C  -0.739135 -0.106278 0.496467
C  0.029926 -1.173475 -0.320578
C  -0.048619 1.260726 0.273514
C  -2.226222 -0.072843 0.150248
C  1.52155 -1.214967 -0.008434
C  1.448835 1.241926 0.558374
C  3.603643 -0.010532 0.690256
C  -2.669313 0.257256 -1.157886
C  -3.198793 -0.378362 1.135036
C  -4.04533 0.281535 -1.471176
C  -4.578184 -0.355631 0.825864
C  4.399447 0.447296 -0.517875
C  -5.006559 -0.025169 -0.479428
C  5.227764 -0.361225 -1.222738
H  -0.641896 -0.365672 1.569626
H  -0.084792 -0.9744 -1.405333
H  -0.366248 -2.187288 -0.143981
H  -0.489395 2.04981 0.905672
H  -0.185775 1.588039 -0.776917
H  3.776036 0.670781 1.541076
H  3.871511 -1.041809 0.966785
H  -1.94003 0.497851 -1.942166
H  -2.873875 -0.636172 2.150763
H  -4.369124 0.538823 -2.485913
H  -5.314761 -0.594785 1.601026
H  4.282526 1.504832 -0.791806
H  -6.07469 -0.00641 -0.722162
H  5.800969 0.012931 -2.07873
H  5.349662 -1.42046 -0.966296
