program: Gaussian 09
title: 000202351
version: EM64L-G09RevD.01
frameworkgroup: C1[X(C8H18OS)]
method: RPBEPBE
basis: SDD
operation: Freq
keyword: #p
keyword: freq=noraman
keyword: PBEPBE/SDD
title: #p freq=noraman PBEPBE/SDD
converged: YES YES NO NO
title: Mulliken charges:
elementType: S O C C C C C C C C H H H H H H H H H H H H H H H H H H
charge: -0.026036 -0.299095 0.293438 0.048166 -0.715921 -0.735039 -0.741209 -0.749765 -0.232624 -0.692377 0.177685 0.192978 0.208895 0.238590 0.248039 0.202614 0.204137 0.215751 0.220445 0.207022 0.213267 0.224510 0.236581 0.201650 0.223914 0.265410 0.272591 0.096385
chargesum: 0.00000
title: Mulliken charges with hydrogens summed into heavy atoms:
elementType: S O C C C C C C C C
charge: 0.070348 -0.299095 0.293438 0.225851 -0.075459 -0.080249 -0.097991 -0.075407 0.192941 -0.154376
polarizability: 1.36717914e+02 1.54475289e+00 9.42395314e+01 1.53668412e+00 1.04695586e+00 9.42095494e+01
1716.lowfreq: -27.0687 -12.8770 -6.5624 -0.0004 0.0028 0.0034 34.0817 42.6233 71.3339
frequency: 33.1881 41.7827 71.2252 82.7168 167.6656 185.1856 195.7240 222.2038 228.1034 232.6470 243.4110 266.4235 280.3717 330.9123 348.6702 357.8564 404.1401 446.4403 462.9720 539.6390 682.4235 723.6386 742.6317 795.8384 842.9026 867.2214 924.5558 928.3115 941.8683 980.1786 987.8315 1005.2600 1035.8329 1043.2535 1071.3635 1075.5589 1108.2364 1185.8589 1213.0943 1229.4932 1245.0779 1264.4546 1275.7227 1316.8755 1325.3703 1350.4823 1365.4648 1373.6519 1386.1663 1399.1832 1445.3355 1453.6769 1462.8804 1464.4004 1468.0039 1471.1836 1474.5645 1483.9860 1488.1461 1499.3342 2432.8026 2920.2755 2966.8378 2970.5413 2975.2507 2980.1025 2989.4066 3041.5875 3051.6271 3056.0589 3063.0844 3067.0175 3071.9471 3078.5698 3090.0107 3094.4688 3096.9137 3119.2376
redmass: 3.0220 3.8530 2.2366 2.8288 1.2157 1.6303 1.4150 1.7931 1.0710 1.1560 2.4942 1.9464 2.0736 2.3046 2.3341 2.4867 3.4760 2.7128 2.8490 2.9020 3.2906 2.5303 1.2471 2.2281 1.3014 2.0294 1.6837 1.6721 1.2208 2.2825 1.6093 2.1626 1.6789 3.5462 1.5414 1.5371 2.4479 1.3289 2.0405 2.9543 1.1863 2.6766 1.1998 1.1983 1.5096 1.2256 1.2104 1.2036 1.2295 1.2068 1.0813 1.0503 1.0810 1.0510 1.0544 1.0496 1.0516 1.0533 1.0510 1.0641 1.0383 1.0833 1.0366 1.0364 1.0602 1.0363 1.0365 1.0598 1.1011 1.0983 1.0984 1.0986 1.0990 1.0978 1.0992 1.0986 1.0997 1.1081
irintensity: 0.7222 0.2923 2.1601 1.8019 0.3088 4.6382 11.1341 16.8120 0.4749 1.0608 0.7888 0.3222 6.9836 2.6293 1.4545 0.9775 2.1087 2.3805 2.7941 2.2869 25.2592 0.1518 3.7080 8.5949 2.9730 8.4239 2.9391 5.0360 0.4171 35.4231 19.6605 66.4723 2.0967 39.6938 73.3418 17.6229 10.8766 28.1467 8.9645 5.2539 3.3222 4.2766 2.2413 9.7944 2.4630 2.5438 16.2587 24.6770 34.0858 19.0234 5.0830 0.3361 5.6219 1.7097 7.5077 3.5098 19.1678 13.5065 4.2388 27.3353 27.1155 40.8664 29.5045 45.3354 33.4051 22.1762 23.6034 16.9226 25.3194 8.7007 41.7975 40.1735 79.4257 32.0362 5.0271 54.5992 23.4343 16.8308
temp: 298.150 k
press: 1.00000 atm
elementType: 16 8 6 6 6 6 6 6 6 6 1 1 1 1 1 1 1 1 1 1 1 1 1 1 1 1 1 1
symmnumber: 1
zpe: 637647.5 jmol-1
zpe.correction: 0.242867 hartree
zpe.thermalcorrener: 0.256962 hartree
zpe.thermalcorrenthalpy: 0.257906 hartree
zpe.thermalcorrgfe: 0.201821 hartree
zpe.sumelectzpe: -788.059619 hartree
zpe.sumelectthermal: -788.045524 hartree
zpe.sumelectthermalent: -788.044580 hartree
zpe.sumelectthermalfe: -788.100665 hartree
dipole: -0.9774 0.4156 -0.0566
dipole: 1.0636
quadrupole: -76.2373 -72.5560 -72.6953
quadrupole: 1.7683 7.0228 -0.4677
quadrupole: -2.4078 1.2735 1.1342 1.7683 7.0228 -0.4677
hfenergy: -788.3024858 hartree
pointgroup: C01 [X(C8H18O1S1)]
dipole: -0.3816068 -0.1683795 -0.0336713 debye
polarizability: 135.5368902|-0.8732059|94.4647756|7.310493|0.8093807|95.1653293 unknown
InChI: InChI=1S/C8H18OS/c1-7(8(2,3)4)9-5-6-10/h7,10H,5-6H2,1-4H3
charge 0 multiplicity 1
28 atoms
S  4.265769 0.290575 1.244574
O  0.652145 -0.636247 -0.643777
C  -1.591411 0.300608 -0.309853
C  -0.494712 -0.628851 0.306571
C  -1.013315 1.737659 -0.418901
C  -2.00591 -0.191019 -1.721184
C  -2.829217 0.327962 0.627214
C  -0.92514 -2.082019 0.579743
C  1.965292 -0.833612 -0.018803
C  2.572227 0.51181 0.413702
H  -0.164342 -0.161855 1.263586
H  -0.743656 2.136126 0.579105
H  -1.75959 2.421805 -0.863731
H  -0.109605 1.745614 -1.05159
H  -1.123981 -0.259999 -2.380727
H  -2.728313 0.515446 -2.171251
H  -2.489231 -1.184711 -1.685583
H  -3.557731 1.076879 0.264969
H  -3.344219 -0.648931 0.659881
H  -2.548781 0.606307 1.6619
H  -0.071588 -2.670003 0.964314
H  -1.728491 -2.130929 1.33607
H  -1.277757 -2.567861 -0.345893
H  1.909714 -1.520974 0.850249
H  2.596206 -1.306667 -0.793491
H  1.952325 1.006489 1.179617
H  2.680355 1.193046 -0.444739
H  4.923655 -0.169552 0.114429
