program: Gaussian 09
title: 000202403
version: EM64L-G09RevD.01
frameworkgroup: C1[X(C12H13BrNO4PS2)]
method: RPBEPBE
basis: SDD
operation: Freq
keyword: #p
keyword: freq=noraman
keyword: PBEPBE/SDD
title: #p freq=noraman PBEPBE/SDD
converged: YES YES NO NO
title: Mulliken charges:
elementType: Br S S P O O O O N C C C C C C C C C C C C H H H H H H H H H H H H H
charge: -0.006106 0.122322 -0.228639 0.588135 -0.209691 -0.194588 -0.442061 -0.463105 -0.173992 -0.482434 0.192091 0.197278 0.139447 0.152547 -0.638637 -0.350602 -0.348563 -0.207820 -0.206892 -0.479300 -0.504820 0.380986 0.312221 0.331270 0.271049 0.272229 0.242012 0.242035 0.245010 0.231707 0.249919 0.232363 0.290385 0.244245
chargesum: 0.00000
title: Mulliken charges with hydrogens summed into heavy atoms:
elementType: Br S S P O O O O N C C C C C C C C C C C C
charge: -0.006106 0.122322 -0.228639 0.588135 -0.209691 -0.194588 -0.442061 -0.463105 -0.173992 -0.101448 0.192091 0.197278 0.139447 0.152547 0.004853 -0.079553 -0.076334 0.034193 0.035143 0.247336 0.262173
polarizability: 2.89813763e+02 3.98603672e+00 2.25791434e+02 4.27447201e+00 -1.90927480e+01 1.98929054e+02
1716.lowfreq: -14.8058 -11.8862 -5.9112 -5.4955 -0.0016 -0.0013 -0.0004 20.6202 31.1363
frequency: -11.9301 18.7758 31.0449 33.5248 44.7462 63.7741 88.5949 95.0926 101.5756 112.8809 118.8929 128.9533 133.5784 140.3481 154.1806 167.2325 177.4237 184.8796 195.8818 242.9143 252.2348 258.5598 300.9389 330.8526 350.0956 360.4152 401.8979 417.2061 437.4591 454.2314 511.0349 524.7533 528.7619 574.8443 583.7688 638.9601 655.0852 658.4833 663.5486 694.1362 699.9425 728.5392 788.8736 799.3696 853.9929 867.9776 908.0105 934.7928 948.7597 955.2801 976.2727 1008.3580 1012.6590 1043.0124 1074.8138 1077.5771 1103.8143 1117.9309 1125.3960 1127.1098 1167.5824 1172.9330 1174.7024 1207.7131 1233.1314 1259.5483 1285.5219 1328.0464 1355.1892 1418.6455 1419.5320 1423.9325 1436.8811 1453.0852 1454.1953 1455.6369 1456.0659 1464.8630 1475.2725 1615.3334 1618.3369 1632.7585 1682.3483 2983.0739 2999.1987 3054.7086 3085.8478 3087.1624 3114.1952 3131.5276 3134.9134 3142.7801 3156.1947 3167.7340 3177.2287 3180.6336
redmass: 6.0179 7.5671 9.4016 9.0963 4.6564 4.6088 7.9228 1.5230 2.1848 6.9872 3.0015 2.8220 2.0391 4.7998 8.1521 5.2793 3.1685 7.6216 5.7412 9.2563 7.2179 10.8587 7.0494 11.1732 7.8478 5.3720 3.3756 8.7021 5.0334 4.8148 4.8019 9.3330 9.6796 7.5402 9.1326 11.9867 7.8892 4.8983 8.4690 5.8364 5.6610 2.8723 5.0837 1.7937 3.2196 3.4135 1.4105 11.1307 2.8259 10.8106 1.4147 1.3547 2.1786 2.3013 2.9917 3.4325 1.2431 1.2633 1.2950 1.2500 1.3447 1.6682 1.3571 1.9993 1.4978 1.2759 1.4988 7.4103 1.3298 5.7427 1.1237 1.1141 1.1020 1.0611 1.0584 2.5770 2.6198 1.0522 1.0543 7.7193 7.7656 11.6272 12.1623 1.0297 1.0285 1.0857 1.1054 1.0562 1.1048 1.1026 1.1056 1.0866 1.0907 1.0957 1.1004 1.1124
irintensity: 1.0654 0.1093 0.3494 0.3652 3.5472 1.6995 1.2629 0.7958 1.8208 0.7911 3.1302 3.1712 2.0960 0.1887 4.0811 4.1633 9.0904 0.6879 13.1611 4.8688 1.8632 6.6174 18.3828 7.9441 11.5706 3.2897 8.6638 40.0248 15.6316 0.3971 12.6094 55.4062 145.1950 62.5759 21.6275 84.7105 20.2661 0.1784 90.7890 5.7347 9.7547 100.2891 0.2651 19.7506 23.7587 10.6040 0.0190 108.1608 36.0405 174.6934 1.5686 0.0029 4.1112 68.9224 0.4548 16.1650 0.2585 1.0158 0.3149 4.3758 10.9908 1.4160 2.7292 4.9226 25.4568 37.1452 0.9537 553.9385 10.4485 4.2989 2.0862 14.2700 38.8912 6.3198 17.9433 9.5932 3.9465 20.0576 15.2856 1.4293 51.8597 318.0314 80.8393 52.5319 47.2177 11.9482 25.4989 3.9452 6.4939 9.4263 3.9804 1.6895 4.8609 4.1136 19.8165 0.9290
temp: 298.150 k
press: 1.00000 atm
elementType: 35 16 16 15 8 8 8 8 7 6 6 6 6 6 6 6 6 6 6 6 6 1 1 1 1 1 1 1 1 1 1 1 1 1
symmnumber: 1
zpe: 619608.8 jmol-1
zpe.correction: 0.235997 hartree
zpe.thermalcorrener: 0.258683 hartree
zpe.thermalcorrenthalpy: 0.259627 hartree
zpe.thermalcorrgfe: 0.180797 hartree
zpe.sumelectzpe: -1969.998261 hartree
zpe.sumelectthermal: -1969.975575 hartree
zpe.sumelectthermalent: -1969.974631 hartree
zpe.sumelectthermalfe: -1970.053461 hartree
dipole: -1.1919 -2.5866 1.8156
dipole: 3.3775
quadrupole: -118.2115 -158.1520 -155.9226
quadrupole: 17.9118 2.5593 -1.9424
quadrupole: 25.8838 -14.0567 -11.8272 17.9118 2.5593 -1.9424
hfenergy: -1970.2342577 hartree
pointgroup: C01 [X(C12H13Br1N1O4P1S2)]
dipole: -0.4892024 -0.7408375 0.9887048 debye
polarizability: 269.2118682|-26.1487763|231.5983778|-31.1834017|-10.9733244|213.7240054 unknown
InChI: InChI=1S/C10H7BrNO2S.C2H6O2PS/c11-5-8(15)12-9(13)6-3-1-2-4-7(6)10(12)14;1-3-5(6)4-2/h1-4,8H,5H2;1-2H3
charge 0 multiplicity 1
34 atoms
Br 0.562669 3.753865 0.247024
S  1.043703 -0.122461 -2.304337
S  2.059049 -3.440256 -0.691175
P  2.569172 -1.550638 -1.353631
O  0.305423 -0.384466 1.787314
O  -2.085465 1.451723 -1.834509
O  3.659026 -1.462714 -2.705616
O  3.338318 -0.514475 -0.176694
N  -0.585771 0.66595 -0.154627
C  0.680864 1.004276 -0.768156
C  -2.138338 -0.225868 1.338124
C  -2.855532 0.329317 0.249924
C  -0.678597 -0.033359 1.093842
C  -1.878367 0.895937 -0.729686
C  0.792756 2.438762 -1.288439
C  -2.797469 -0.837626 2.414831
C  -4.256804 0.291639 0.20163
C  -4.215256 -0.880042 2.3759
C  -4.933506 -0.324068 1.286507
C  4.693808 -2.515561 -2.845881
C  3.516425 -0.998855 1.220832
H  1.485571 0.783389 -0.046148
H  1.801457 2.623611 -1.680715
H  0.010602 2.698556 -2.01388
H  -2.232807 -1.265633 3.248722
H  -4.800326 0.722555 -0.64475
H  -4.765723 -1.350137 3.197593
H  -6.027499 -0.373125 1.284361
H  4.241197 -3.522607 -2.79776
H  5.467766 -2.407152 -2.065318
H  5.127716 -2.335286 -3.840296
H  4.055188 -1.961757 1.234556
H  2.539217 -1.092751 1.720463
H  4.119335 -0.207842 1.692194
