program: Gaussian 09
title: 000202448
version: EM64L-G09RevD.01
frameworkgroup: C1[X(C24H27NO2)]
method: RPBEPBE
basis: SDD
operation: Freq
keyword: #p
keyword: freq=noraman
keyword: PBEPBE/SDD
title: #p freq=noraman PBEPBE/SDD
converged: YES YES NO NO
title: Mulliken charges:
elementType: O O N C C C C C C C C C C C C C C C C C C C C C C C C H H H H H H H H H H H H H H H H H H H H H H H H H H H
charge: -0.478473 -0.344232 -0.081722 -0.085859 0.201061 0.336901 0.387361 0.277530 -0.348692 -0.418721 -0.298017 -0.383202 -0.395928 -0.370438 -0.405298 -0.324600 -0.380700 -0.269208 -0.238872 -0.248988 -0.233205 -0.235682 -0.243921 -0.241673 -0.248727 -0.623197 -0.615059 0.263229 0.210235 0.235746 0.222590 0.205430 0.256805 0.276522 0.279959 0.255613 0.380548 0.204039 0.188807 0.250672 0.229132 0.226198 0.223585 0.222470 0.222628 0.223349 0.224332 0.225529 0.234600 0.192816 0.218389 0.192381 0.223590 0.222370
chargesum: 0.00000
title: Mulliken charges with hydrogens summed into heavy atoms:
elementType: O O N C C C C C C C C C C C C C C C C C C C C C C C C
charge: -0.097925 -0.344232 -0.081722 -0.085859 0.201061 0.336901 0.387361 0.277530 -0.085463 0.027259 0.130003 -0.126398 -0.119406 -0.090478 -0.149685 0.068246 -0.130028 -0.040076 -0.012675 -0.025403 -0.010735 -0.013053 -0.020572 -0.017341 -0.023198 0.022608 0.023281
polarizability: 2.95021528e+02 -1.00844184e+01 2.61552905e+02 1.60782922e+01 2.59758410e+00 2.40078188e+02
1716.lowfreq: -7.8392 -7.2464 0.0003 0.0004 0.0007 6.5243 15.8619 25.2970 31.4341
frequency: 15.7628 25.1071 31.3856 32.9205 43.7925 50.2311 57.7647 62.8420 86.4818 94.4702 106.8957 133.4448 171.8903 190.5298 217.6598 228.6770 233.4583 237.3642 242.6984 253.7325 262.8317 279.5342 304.0669 330.4968 342.8481 352.4855 403.8057 405.6606 406.6968 409.4118 434.0688 462.8148 478.2881 492.2403 518.6075 530.0986 579.7134 593.9877 612.2474 615.7677 616.3555 630.1536 637.0031 687.6974 705.8107 707.6486 737.0445 746.5985 757.4603 765.3767 769.6329 794.7331 829.9524 850.3417 858.2994 861.9268 884.3775 897.6423 912.7296 925.7096 932.6248 940.9163 945.2755 967.1750 979.8229 982.0431 986.5693 989.9204 990.4377 995.1786 997.7277 1026.7577 1028.3655 1031.4099 1032.7489 1042.1838 1048.9255 1077.4615 1082.4633 1086.5067 1094.1919 1101.2708 1108.9251 1140.9202 1155.1852 1168.8112 1169.5000 1170.9226 1174.6849 1175.6715 1183.0328 1189.6707 1196.2957 1207.3811 1234.0974 1237.8011 1264.9700 1283.3721 1301.4773 1311.0997 1312.8580 1330.8825 1347.0246 1365.0563 1377.8452 1380.4923 1383.8237 1386.0390 1421.2118 1432.1393 1433.3512 1436.3561 1443.1666 1450.9849 1462.1066 1468.7051 1469.5898 1476.1813 1476.4477 1479.8791 1480.4311 1486.9618 1487.5464 1588.4032 1589.8871 1591.0788 1603.2357 1607.3862 1612.1430 2841.5627 2851.1007 2868.3282 2957.6211 2999.2151 3001.7025 3019.7543 3026.8221 3031.8091 3067.7271 3078.0754 3088.2722 3117.7094 3120.6466 3126.1278 3131.1144 3131.9764 3138.8281 3144.3068 3147.8795 3152.2177 3158.2664 3160.9618 3163.4102 3171.2509 3176.4801 3407.3582
redmass: 5.0118 3.6870 3.9612 3.5049 3.1268 3.7941 4.5158 4.9817 4.1692 4.1621 2.7821 2.9342 5.4048 3.4141 3.4898 2.6191 1.1368 2.4946 4.5554 1.4444 4.1140 4.3693 4.8591 5.2596 2.3429 4.9015 2.8621 2.7815 2.7512 2.6645 4.1578 4.0761 3.4342 3.3234 3.5637 3.7275 4.5817 2.0259 2.0323 5.5628 5.8796 5.1457 4.0371 5.8342 1.8048 1.7506 3.1239 2.3791 1.3412 1.8494 1.9473 3.2650 2.1192 1.4289 1.2476 1.2523 3.0693 3.2425 2.4845 2.1096 1.6919 1.7002 1.6324 3.7834 1.3586 1.3920 1.5006 4.7532 5.5510 1.3207 1.3463 2.2644 2.1425 2.9225 1.6426 1.9450 2.2595 1.6502 1.5799 1.6293 1.5206 2.4681 1.9419 1.5644 2.2115 1.1104 1.0989 1.4516 1.7692 1.0910 1.2158 1.2210 2.8188 3.4163 1.3149 1.7228 2.4547 1.4381 1.1979 1.3444 1.3519 1.3537 1.4400 1.9874 7.3787 8.6958 1.4601 2.9624 1.1459 2.2088 2.2391 2.2188 1.1657 1.0775 1.0488 1.1385 1.6088 1.9724 1.1353 2.0991 1.0701 1.3384 1.0873 6.6944 6.3833 6.2949 6.3757 6.0885 6.1158 1.0679 1.0570 1.0577 1.0569 1.0664 1.0847 1.0731 1.1029 1.0727 1.1020 1.1010 1.1005 1.0844 1.0845 1.0879 1.0886 1.0855 1.0932 1.0936 1.0900 1.0958 1.0988 1.0935 1.0996 1.0995 1.0956 1.0651
irintensity: 0.1205 0.1140 0.0148 0.0501 0.2676 0.3739 0.9328 0.3443 2.8407 0.7113 0.4905 0.0793 0.3446 0.8326 0.0627 0.8635 1.2147 0.7127 0.3927 1.5987 0.7795 0.6909 0.4220 2.3835 10.9876 3.7829 0.7527 3.0905 1.3284 0.5869 3.5539 2.0464 9.1865 2.8838 4.3500 8.1540 1.2884 30.9032 60.4710 2.4760 1.0878 37.5962 65.8669 2.2781 55.9852 53.9609 5.3450 7.5484 86.1124 50.5498 53.3665 8.8138 17.7956 0.2466 0.1456 0.6152 26.5790 11.8351 15.5008 23.6498 9.2726 8.6272 2.6426 31.3788 1.3051 0.9190 0.8593 1.2593 0.8728 0.2923 0.4579 4.9818 18.6763 32.7599 29.2309 36.7194 12.2672 7.9392 1.4863 9.6641 6.2305 35.4536 14.4934 8.6147 4.5041 3.3678 1.0355 8.8720 7.0348 20.7238 7.4387 6.7427 76.1027 143.4519 0.9533 4.8221 6.9614 24.6642 5.4460 1.8216 0.9452 5.2289 50.1086 38.7380 0.6226 0.2884 3.1927 30.2337 2.4529 7.4157 27.1319 38.3923 1.8810 12.3351 20.3998 16.4481 55.6115 19.5818 9.4848 15.1745 15.8143 7.7790 20.6045 14.7515 2.8220 0.3732 24.5512 13.8376 3.3074 105.7886 66.6184 185.4278 42.7020 14.2308 21.2015 51.0672 32.3531 51.9897 32.9997 35.7356 47.8966 1.3775 0.2981 5.2491 11.0007 2.3254 27.4037 28.7708 13.1278 25.5913 28.7905 21.2988 20.3803 19.2210 9.0706 132.8438
temp: 298.150 k
press: 1.00000 atm
elementType: 8 8 7 6 6 6 6 6 6 6 6 6 6 6 6 6 6 6 6 6 6 6 6 6 6 6 6 1 1 1 1 1 1 1 1 1 1 1 1 1 1 1 1 1 1 1 1 1 1 1 1 1 1 1
symmnumber: 1
zpe: 1175957.9 jmol-1
zpe.correction: 0.447899 hartree
zpe.thermalcorrener: 0.473461 hartree
zpe.thermalcorrenthalpy: 0.474405 hartree
zpe.thermalcorrgfe: 0.389919 hartree
zpe.sumelectzpe: -1133.953371 hartree
zpe.sumelectthermal: -1133.927809 hartree
zpe.sumelectthermalent: -1133.926865 hartree
zpe.sumelectthermalfe: -1134.011351 hartree
dipole: 1.6737 1.6709 1.4345
dipole: 2.7661
quadrupole: -151.4982 -149.4539 -154.8868
quadrupole: -0.7883 -1.4574 1.2264
quadrupole: 0.4481 2.4924 -2.9405 -0.7883 -1.4574 1.2264
hfenergy: -1134.4012699 hartree
pointgroup: C01 [X(C24H27N1O2)]
dipole: -0.7008713 -0.6341255 0.5394178 debye
polarizability: 295.526088|-11.0921584|262.2156244|-13.9354264|-2.596198|238.9109083 unknown
InChI: InChI=1S/C24H27NO2/c1-25(2)18-11-19-27-23-17-10-9-16-22(23)24(26,20-12-5-3-6-13-20)21-14-7-4-8-15-21/h3-10,12-17,26H,11,18-19H2,1-2H3
charge 0 multiplicity 1
54 atoms
O  0.098776 0.357383 -1.440783
O  -1.404368 -1.274259 0.069338
N  -5.09923 0.701595 -1.295196
C  0.985926 0.154311 -0.265995
C  0.998007 -1.356183 0.084929
C  2.374547 0.642939 -0.727124
C  0.464625 1.006532 0.918134
C  -0.239516 -2.050299 0.255853
C  2.187134 -2.100699 0.239173
C  -3.767572 -0.753346 0.268476
C  -2.724516 -1.867027 0.373608
C  3.324502 1.153094 0.191052
C  -0.107648 2.274115 0.642217
C  2.729123 0.536639 -2.094975
C  0.574885 0.583875 2.264623
C  -3.919594 -0.186275 -1.15813
C  -0.278177 -3.425035 0.575496
C  2.166352 -3.478889 0.561285
C  0.932517 -4.138536 0.731403
C  4.607941 1.550227 -0.2493
C  -0.569031 3.097392 1.691547
C  4.009299 0.937946 -2.536247
C  0.112038 1.407161 3.317741
C  4.956449 1.44336 -1.615026
C  -0.462872 2.666703 3.035865
C  -4.981588 1.946236 -0.504483
C  -5.3969 0.990532 -2.715013
H  3.146753 -1.592261 0.105527
H  -4.7466 -1.165964 0.581693
H  -3.495776 0.042986 0.984891
H  -2.699388 -2.285222 1.399319
H  -2.929249 -2.686673 -0.346651
H  3.059583 1.254945 1.248955
H  -0.18627 2.596881 -0.40088
H  1.983529 0.15761 -2.798893
H  1.014575 -0.39379 2.493428
H  -0.783991 -0.029424 -1.176341
H  -4.0553 -1.030217 -1.863359
H  -2.975691 0.340588 -1.456502
H  -1.232432 -3.9455 0.696121
H  3.10766 -4.02642 0.674856
H  0.902064 -5.20551 0.978496
H  5.330316 1.947642 0.472909
H  -1.007789 4.07591 1.463622
H  4.267228 0.85743 -3.598615
H  0.201621 1.064379 4.355175
H  5.949716 1.755499 -1.957692
H  -0.821361 3.305449 3.851269
H  -4.907689 1.716517 0.571556
H  -4.090036 2.56228 -0.788861
H  -5.887097 2.560282 -0.655068
H  -4.583868 1.560312 -3.23302
H  -5.553749 0.044231 -3.263075
H  -6.326272 1.58355 -2.785025
