program: Gaussian 09
title: 000202416
version: EM64L-G09RevD.01
frameworkgroup: C1[X(C20H26N2O4)]
method: RPBEPBE
basis: SDD
operation: Freq
keyword: #p
keyword: freq=noraman
keyword: PBEPBE/SDD
title: #p freq=noraman PBEPBE/SDD
converged: YES YES NO NO
title: Mulliken charges:
elementType: O O O O N N C C C C C C C C C C C C C C C C C C C C H H H H H H H H H H H H H H H H H H H H H H H H H H
charge: -0.291525 -0.304489 -0.309436 -0.278036 -0.161137 -0.474893 0.471549 -0.397764 -0.397910 -0.352501 -0.365823 0.506562 -0.663050 -0.663617 -0.507317 -0.379312 0.366482 0.105979 -0.554886 -0.523449 0.237659 0.288979 0.040821 -0.523652 -0.526532 -0.524648 0.224910 0.218500 0.220366 0.221335 0.226607 0.226654 0.215014 0.242648 0.212658 0.217522 0.238782 0.211794 0.214136 0.304826 0.314956 0.296133 0.241674 0.228976 0.215477 0.263471 0.227218 0.248030 0.230840 0.231632 0.260192 0.227596
chargesum: 0.00000
title: Mulliken charges with hydrogens summed into heavy atoms:
elementType: O O O O N N C C C C C C C C C C C C C C C C C C C C
charge: -0.291525 -0.304489 -0.309436 -0.278036 -0.161137 -0.159937 0.471549 0.045647 0.043792 -0.125894 -0.139170 0.506562 0.007270 0.004481 -0.293181 -0.074486 0.366482 0.105979 -0.258754 -0.281775 0.237659 0.288979 0.040821 0.184272 0.179555 0.194772
polarizability: 4.98377637e+02 8.92059284e+00 2.52571147e+02 -2.55118876e+00 1.04818198e+01 1.45761606e+02
1716.lowfreq: -1.9927 -0.0004 0.0003 0.0011 1.9676 9.7543 17.1351 18.9363 35.0096
frequency: 17.0379 18.8363 34.9421 49.0967 54.6388 68.4322 75.8360 83.8314 84.5057 91.3603 98.0311 108.8902 119.5453 145.3570 153.1570 161.4291 162.4759 169.2251 191.1580 204.7824 210.9551 218.8817 227.5881 250.2368 272.2922 283.2598 305.3338 322.8908 335.8076 353.7249 369.2744 379.2047 396.7580 418.7416 424.5541 434.4345 487.7910 511.8891 520.9740 528.9601 540.9942 570.9263 614.7358 626.8263 631.1568 645.8810 661.1495 695.3796 722.0225 731.9359 769.6337 776.4484 784.8254 790.8167 797.5988 827.4532 840.7440 864.3675 876.7400 890.2603 900.2245 919.2606 922.9785 923.6672 940.8796 977.1327 988.4857 996.3310 1014.1570 1036.4620 1072.7298 1077.4593 1078.7828 1095.1226 1111.8557 1114.7722 1116.0083 1135.0672 1146.2214 1152.0560 1158.7828 1159.5035 1166.1037 1196.7145 1203.1937 1206.3958 1221.5929 1261.7071 1269.6063 1290.2828 1299.2176 1323.4375 1340.6617 1351.1946 1358.2855 1368.6248 1385.4641 1387.4830 1391.1337 1399.5899 1417.2260 1432.6681 1435.5399 1437.4833 1453.2355 1458.8652 1459.5105 1463.7002 1466.9600 1468.0957 1476.2312 1477.6710 1482.9981 1485.2024 1487.0958 1491.4591 1501.9387 1504.3187 1523.5547 1557.2409 1577.9961 1594.6636 1602.1270 1638.8625 2973.7920 2977.1351 2980.6994 2981.3175 2982.0885 2982.2358 2988.4433 3031.2891 3037.8885 3070.9271 3077.1805 3077.3722 3082.1852 3085.5005 3091.1164 3092.9805 3103.5069 3122.1480 3124.3849 3128.6737 3142.1843 3156.9575 3164.3194 3176.3560 3190.9842 3530.7203
redmass: 3.7911 4.7324 4.5739 4.2775 3.4617 3.9841 2.8104 3.5559 3.4324 3.2735 2.7575 3.3134 2.6364 3.0523 1.7857 1.4945 1.8451 1.1310 3.4840 3.1646 1.8904 1.0291 2.1536 4.5733 3.3753 5.0394 3.1355 4.3133 3.9900 4.9735 5.3977 5.4388 3.7465 3.8893 3.6389 4.4566 4.1965 2.6309 4.9193 3.9543 2.7362 5.6967 4.0642 2.0559 6.6488 2.1893 3.9084 4.3889 3.7080 4.6698 3.8461 3.5441 1.1372 1.4764 1.3867 1.5531 4.9113 3.5186 2.4038 2.3483 5.9079 1.6360 1.5605 1.7694 9.3254 1.3052 5.6827 3.4541 2.9631 6.5167 2.1258 2.1086 1.8333 1.6523 1.2382 1.2382 1.2371 1.4937 1.7113 1.3954 1.5144 1.8436 2.6599 1.7837 1.2090 2.3034 1.6270 1.5820 1.6666 1.2247 5.2990 1.5417 1.2869 1.3389 6.9781 4.0319 1.2122 1.2315 2.9296 2.1962 1.3493 2.6272 1.4206 1.3979 1.3128 1.0730 1.1836 1.4347 1.0528 1.0447 1.0602 1.0600 1.0486 1.0539 1.0551 1.0802 1.5167 1.7615 2.4070 7.6251 5.3833 4.8669 6.7248 6.3248 1.0306 1.0337 1.0297 1.0418 1.0368 1.0535 1.0603 1.1029 1.1019 1.1043 1.0995 1.0994 1.1051 1.0985 1.1008 1.1006 1.0896 1.1026 1.1036 1.1046 1.0911 1.0887 1.0922 1.0922 1.0949 1.0757
irintensity: 0.2839 1.7564 1.6252 0.7095 0.4334 1.5046 0.6944 2.9202 6.5876 1.9354 8.5912 2.4372 2.1249 1.9410 3.7386 1.0024 1.7251 0.0635 0.5286 5.9708 3.7035 0.4909 4.1785 13.5699 0.5346 14.5235 0.9056 3.6553 0.4501 0.8294 2.5222 0.9212 12.3721 8.4797 8.6489 1.7388 10.2060 18.9492 3.8813 16.0323 3.5234 2.6152 13.4043 15.3811 1.8788 38.0277 13.3893 6.8035 1.5781 20.5614 4.3558 7.6180 5.0337 26.4100 35.9125 59.1935 12.9499 4.7080 12.0173 1.1592 45.5569 3.5106 30.5642 3.7958 77.4077 4.0567 77.8587 21.6030 55.1291 168.1440 13.9892 25.1974 22.5373 18.3713 9.4346 16.2611 4.1009 7.8961 22.4560 7.2064 17.0857 35.7393 21.6026 12.2998 17.6036 53.0582 17.5437 130.3864 35.1079 4.7103 283.2670 106.0687 32.0647 137.4130 14.9490 96.7990 6.9655 40.1820 35.2130 78.5773 14.1485 53.3526 11.3490 32.9623 57.7827 23.8667 17.7496 40.8819 7.8914 11.9029 1.1958 6.3430 0.8312 19.7325 43.8701 34.1499 24.8517 247.6117 384.8267 232.1291 65.8939 45.4886 47.7334 175.0531 69.7656 101.7826 74.8722 42.3286 34.8221 42.9210 70.8339 6.7632 22.7561 26.1839 22.8595 74.3017 18.6345 35.1539 20.7784 80.1153 19.8228 25.6136 26.0408 14.0124 5.5343 21.3724 23.3007 3.0260 9.5348 8.9453
temp: 298.150 k
press: 1.00000 atm
elementType: 8 8 8 8 7 7 6 6 6 6 6 6 6 6 6 6 6 6 6 6 6 6 6 6 6 6 1 1 1 1 1 1 1 1 1 1 1 1 1 1 1 1 1 1 1 1 1 1 1 1 1 1
symmnumber: 1
zpe: 1116783.8 jmol-1
zpe.correction: 0.425360 hartree
zpe.thermalcorrener: 0.453211 hartree
zpe.thermalcorrenthalpy: 0.454155 hartree
zpe.thermalcorrgfe: 0.365009 hartree
zpe.sumelectzpe: -1186.131262 hartree
zpe.sumelectthermal: -1186.103411 hartree
zpe.sumelectthermalent: -1186.102467 hartree
zpe.sumelectthermalfe: -1186.191614 hartree
dipole: 0.5138 3.0942 0.1383
dipole: 3.1396
quadrupole: -90.2869 -153.7029 -155.1294
quadrupole: 0.3878 2.9197 2.0000
quadrupole: 42.7529 -20.6632 -22.0896 0.3878 2.9197 2.0000
hfenergy: -1186.5566226 hartree
pointgroup: C01 [X(C20H26N2O4)]
dipole: -0.2185629 1.2157095 0.0052239 debye
polarizability: 498.58555|-5.4599432|253.1541655|-1.7286615|-5.2024081|144.9706739 unknown
InChI: InChI=1S/C20H26N2O4/c1-6-22(7-2)16-10-8-15(9-11-16)21-20(23)14-12-17(24-3)19(26-5)18(13-14)25-4/h8-13,21H,6-7H2,1-5H3
charge 0 multiplicity 1
52 atoms
O  4.030855 2.705891 0.256864
O  5.251508 -2.06112 -0.359583
O  6.075417 0.702173 -0.200336
O  0.222808 -2.027935 0.488868
N  -6.124629 0.02096 -0.046023
N  -0.412895 0.157257 -0.094369
C  -4.720476 0.037655 -0.053934
C  -6.877993 -1.160789 0.413486
C  -6.911242 1.181436 -0.502118
C  -3.986457 1.215396 -0.407267
C  -3.951126 -1.119622 0.289249
C  -1.835384 0.0651 -0.067596
C  -7.108613 -2.221957 -0.689912
C  -7.15486 2.242956 0.598512
C  -2.581877 1.220408 -0.416071
C  -2.545149 -1.11195 0.28793
C  1.965728 -0.375205 0.124219
C  0.527336 -0.825611 0.197882
C  2.948268 -1.379327 -0.051674
C  2.371524 0.97472 0.272076
C  3.735774 1.33334 0.184287
C  4.308306 -1.033053 -0.127252
C  4.718401 0.3313 -0.056457
C  5.100347 3.123166 1.19189
C  6.240006 -2.254211 0.727367
C  6.627347 0.448185 -1.556622
H  -6.359933 -1.617653 1.277743
H  -7.856757 -0.811767 0.794313
H  -7.88597 0.807669 -0.869278
H  -6.415569 1.646362 -1.37565
H  -4.508386 2.140786 -0.665197
H  -4.451502 -2.056071 0.551246
H  -7.678382 -1.792148 -1.533809
H  -6.149362 -2.596932 -1.086611
H  -7.680096 -3.080857 -0.290639
H  -7.706357 1.804246 1.449777
H  -6.200503 2.640816 0.985048
H  -7.749611 3.087013 0.201314
H  -2.058525 2.146757 -0.68983
H  -1.98429 -2.012052 0.546447
H  -0.044012 1.057678 -0.407659
H  2.643701 -2.427367 -0.117162
H  1.666756 1.783311 0.494674
H  5.151261 4.218101 1.092957
H  4.82446 2.852058 2.229186
H  6.061976 2.658646 0.920712
H  5.724333 -2.56297 1.656058
H  6.819149 -1.330079 0.904775
H  6.900344 -3.063037 0.379554
H  6.089858 1.062154 -2.302212
H  6.54362 -0.622938 -1.811159
H  7.683471 0.753513 -1.504013
