program: Gaussian 09
title: 000202349
version: EM64L-G09RevD.01
frameworkgroup: C1[X(C8H16ClO2PS)]
method: RPBEPBE
basis: SDD
operation: Freq
keyword: #p
keyword: freq=noraman
keyword: PBEPBE/SDD
title: #p freq=noraman PBEPBE/SDD
converged: YES YES NO NO
title: Mulliken charges:
elementType: Cl S P O O C C C C C C C C H H H H H H H H H H H H H H H H
charge: -0.122632 -0.160075 0.647969 -0.461531 -0.413583 -0.043650 -0.045129 -0.400505 -0.397446 -0.404981 -0.355530 -0.710820 -0.698220 0.249923 0.228402 0.215712 0.203664 0.267540 0.224348 0.205115 0.222142 0.190764 0.245865 0.220631 0.222312 0.227008 0.204211 0.214617 0.223879
chargesum: 0.00000
title: Mulliken charges with hydrogens summed into heavy atoms:
elementType: Cl S P O O C C C C C C C C
charge: -0.122632 -0.160075 0.647969 -0.461531 -0.413583 0.206274 0.183273 0.018870 0.094442 0.022276 0.081100 -0.040869 -0.055514
polarizability: 1.56834728e+02 -1.07460133e+01 1.33931396e+02 1.15309424e+00 5.65882470e-01 1.44562624e+02
1716.lowfreq: -12.7935 -8.5236 -0.0025 -0.0022 -0.0014 11.2376 37.9936 47.3835 56.6038
frequency: 37.9372 47.3751 56.4285 72.5110 84.6853 109.4351 128.9886 143.0126 152.3781 202.2185 220.5401 227.9426 249.0238 260.7300 282.1107 298.4202 321.5617 349.2004 393.0410 428.8799 471.5651 495.1305 558.5442 568.2725 676.0386 694.2037 750.7634 765.4249 806.5350 869.9875 881.9204 898.9213 908.0455 918.0589 984.9218 1030.7696 1034.8353 1068.4910 1077.9658 1104.1230 1122.6516 1139.6642 1150.8616 1205.5934 1229.0963 1235.2701 1269.3181 1278.7835 1294.3493 1303.4376 1316.6237 1334.7702 1349.8850 1359.0031 1364.1556 1391.6550 1399.8787 1446.4323 1456.5321 1471.8736 1475.1633 1478.9389 1481.1759 1486.5827 1492.5486 2950.0221 2972.6456 2973.4031 2976.2652 2978.2176 2983.7330 2986.4182 3007.5748 3036.8284 3045.2444 3052.6485 3076.4363 3078.9608 3079.0380 3084.2625 3113.0330
redmass: 6.3266 5.1297 1.8016 3.2387 2.1398 3.5436 5.6557 3.7680 4.1075 3.5455 2.9031 1.1623 2.0811 3.8257 3.6210 4.6102 4.6202 2.3733 5.7829 7.5911 3.9076 3.3526 4.1937 7.6690 7.1321 3.6165 1.3525 1.3304 3.7365 2.2864 1.4862 1.9557 3.0018 1.9137 2.0400 2.3134 2.1331 2.2655 2.1206 2.2591 2.0359 2.3889 2.0439 1.2474 1.3316 1.2920 1.2340 1.1925 1.1560 1.1694 1.2433 1.3563 1.3989 1.3316 1.5424 1.2149 1.2010 1.0822 1.0827 1.0683 1.0470 1.0436 1.0510 1.0839 1.0513 1.0834 1.0367 1.0654 1.0682 1.0640 1.0371 1.0609 1.0820 1.0957 1.0959 1.0996 1.0995 1.1000 1.0996 1.0997 1.0969
irintensity: 0.1573 0.3606 0.0586 1.1586 0.2131 0.0811 2.9452 0.1043 0.6353 0.3408 3.2316 0.2863 1.0543 4.4761 0.2212 9.3075 10.3177 1.5611 8.4558 33.1831 14.1431 6.5355 22.4607 102.7580 91.0106 86.0184 36.5891 2.5899 133.0995 15.9506 9.9988 18.3510 114.4382 99.1165 12.4279 10.7831 1.6197 11.6737 1.1362 14.5150 14.5067 3.6950 2.6400 0.3920 2.3187 0.4756 2.2054 8.5134 10.5396 3.5180 2.8942 3.1322 1.7381 8.9545 2.3845 10.4521 13.6378 3.2329 10.5384 4.6507 4.5914 11.2689 9.9966 12.9462 13.4855 8.7207 41.4897 19.6276 16.6876 7.7974 33.8716 33.5396 18.4919 18.7407 9.0986 0.6095 44.9279 84.5500 22.2300 55.1876 8.4075
temp: 298.150 k
press: 1.00000 atm
elementType: 17 16 15 8 8 6 6 6 6 6 6 6 6 1 1 1 1 1 1 1 1 1 1 1 1 1 1 1 1
symmnumber: 1
zpe: 613444.5 jmol-1
zpe.correction: 0.233649 hartree
zpe.thermalcorrener: 0.250088 hartree
zpe.thermalcorrenthalpy: 0.251033 hartree
zpe.thermalcorrgfe: 0.188331 hartree
zpe.sumelectzpe: -1663.187016 hartree
zpe.sumelectthermal: -1663.170576 hartree
zpe.sumelectthermalent: -1663.169632 hartree
zpe.sumelectthermalfe: -1663.232333 hartree
dipole: -5.8825 1.9904 0.5762
dipole: 6.2368
quadrupole: -106.6152 -98.7274 -105.5537
quadrupole: -2.5218 -0.6055 0.8438
quadrupole: -2.9831 4.9047 -1.9216 -2.5218 -0.6055 0.8438
hfenergy: -1663.4206642 hartree
pointgroup: C01 [X(C8H16Cl1O2P1S1)]
dipole: -1.6795643 -1.7697793 -0.2604445 debye
polarizability: 142.9545632|15.5344993|147.8154963|-1.0169544|0.0451834|144.5586883 unknown
InChI: InChI=1S/C8H16ClO2PS/c1-3-5-8-7(4-2)6-10-12(9,13)11-8/h7-8H,3-6H2,1-2H3
charge 0 multiplicity 1
29 atoms
Cl 2.710642 2.259873 1.607289
S  2.31937 1.717222 -2.00375
P  1.857231 1.119156 -0.103624
O  0.187196 1.123179 0.363438
O  2.331359 -0.487968 0.373759
C  -0.049773 -1.376579 0.265471
C  -0.628874 -0.018465 -0.224845
C  -2.064624 0.29952 0.211163
C  1.422047 -1.545768 -0.18116
C  -0.89808 -2.568954 -0.265588
C  -2.572049 1.665958 -0.30273
C  -0.378715 -3.962729 0.15762
C  -4.020835 1.952195 0.145039
H  -0.076638 -1.376385 1.373613
H  -0.537406 0.047941 -1.332421
H  -2.114227 0.270659 1.317761
H  -2.732201 -0.498873 -0.168219
H  1.864403 -2.469586 0.218458
H  1.504071 -1.544078 -1.288427
H  -0.95814 -2.515805 -1.37275
H  -1.931436 -2.454785 0.108948
H  -2.51258 1.685301 -1.410125
H  -1.897455 2.459807 0.063548
H  0.573138 -4.227315 -0.336216
H  -0.221027 -4.014145 1.251202
H  -1.113155 -4.742541 -0.111944
H  -4.720776 1.181955 -0.231813
H  -4.099429 1.967291 1.248485
H  -4.366735 2.932815 -0.228583
