program: Gaussian 09
title: 000202381
version: EM64L-G09RevD.01
frameworkgroup: C1[X(C15H19NO4)]
method: RPBEPBE
basis: SDD
operation: Freq
keyword: #p
keyword: freq=noraman
keyword: PBEPBE/SDD
title: #p freq=noraman PBEPBE/SDD
converged: YES YES NO NO
title: Mulliken charges:
elementType: O O O O N C C C C C C C C C C C C C C C H H H H H H H H H H H H H H H H H H H
charge: -0.308818 -0.286884 -0.305930 -0.287374 -0.387446 0.612503 0.033212 0.238339 0.278077 -0.581726 -0.565079 -0.265285 -0.383542 0.244842 -0.421292 -0.523548 -0.523338 -0.527918 -0.045790 -0.571066 0.264369 0.248197 0.275612 0.207146 0.293111 0.261482 0.219601 0.255489 0.235039 0.228476 0.260861 0.215910 0.231202 0.230611 0.222889 0.253596 0.238819 0.219151 0.216499
chargesum: 0.00000
title: Mulliken charges with hydrogens summed into heavy atoms:
elementType: O O O O N C C C C C C C C C C C C C C C
charge: -0.308818 -0.286884 -0.305930 -0.287374 -0.094335 0.612503 0.033212 0.238339 0.278077 -0.317357 -0.316883 0.010327 -0.176396 0.244842 0.059792 0.195455 0.184636 0.179179 0.193029 -0.135416
polarizability: 3.63269123e+02 -1.88977471e+01 1.89070919e+02 5.37423400e+00 -2.26386794e+00 1.09770325e+02
1716.lowfreq: -3.4350 -0.0006 -0.0004 -0.0003 4.5133 10.2132 16.9996 33.9501 43.5199
frequency: 16.9153 33.8861 43.4933 53.3232 65.0036 73.0434 82.1172 87.9894 96.6155 104.8558 146.7646 156.0374 163.7483 166.2562 173.9747 185.6875 199.2178 228.3296 240.9453 272.7522 279.9334 293.2854 327.4027 351.8766 367.3911 395.2809 429.0252 467.9242 508.0613 515.5743 559.7975 569.2144 601.2608 621.3475 642.9248 659.3260 700.0343 708.5598 756.0150 770.8213 864.5886 869.0669 882.5693 891.3030 900.7359 913.5562 929.8286 939.2203 951.9083 998.6564 1011.6690 1012.5300 1016.2929 1036.0001 1065.5989 1109.5552 1111.9321 1112.5466 1121.5736 1141.4413 1149.8915 1155.7166 1158.3345 1188.1498 1192.5938 1217.6837 1240.0638 1267.3164 1279.9551 1312.1851 1323.3191 1341.7659 1364.9788 1400.9878 1418.8866 1426.8152 1433.2727 1436.3265 1455.8868 1458.0705 1460.1259 1464.9412 1468.4959 1476.3824 1477.6908 1483.5781 1486.2804 1561.1553 1582.1727 1603.8124 1654.9986 1655.9284 2973.1196 2976.2910 2978.9327 2981.9001 3041.0305 3071.6260 3082.9368 3083.8676 3086.9351 3100.7676 3106.2443 3107.8240 3122.8945 3124.2471 3128.3663 3155.4045 3164.2064 3198.4190 3548.3192
redmass: 4.5585 4.2773 3.6791 4.6703 2.8234 2.6603 3.3919 3.1183 2.8177 2.9975 1.3988 2.9547 1.2824 1.1299 2.3279 3.5708 3.3666 4.0121 4.1143 5.3905 5.2551 4.0285 4.1547 2.7032 5.1246 3.1807 5.7595 3.2906 3.7678 4.5110 1.4062 3.4732 4.5178 2.9872 4.0111 1.8857 5.4767 5.1585 4.4487 3.5503 3.0987 2.3498 1.8064 1.9982 1.7594 3.3277 2.7931 9.3626 1.3485 1.4903 1.6284 2.0858 1.7213 6.2069 3.8871 1.2385 1.2411 1.2699 2.8845 1.9414 1.3553 1.4587 1.4481 1.6869 2.0358 1.4443 1.2214 1.8569 1.2457 1.9771 1.6669 1.7748 4.8978 2.1662 1.2743 1.2001 1.2695 1.5342 1.1469 1.0665 1.0725 1.2743 2.0125 1.1059 1.6086 1.0545 1.0576 7.2296 6.8092 6.6683 5.5691 4.6297 1.0311 1.0335 1.0601 1.0295 1.1002 1.1038 1.1003 1.1041 1.0602 1.0934 1.0946 1.0870 1.1029 1.1036 1.1043 1.0920 1.0915 1.1141 1.0776
irintensity: 1.9560 0.3149 1.5086 4.2754 1.8540 0.3973 2.2463 2.7730 6.1906 9.1901 1.8486 1.8485 0.2532 0.4529 0.0490 0.5837 5.1500 8.1360 13.6920 11.7082 7.6672 7.4680 5.8737 5.5798 5.6155 4.3309 4.5909 13.0114 2.5573 4.4622 92.6114 49.9565 0.4639 4.0256 4.9034 21.3190 1.8171 3.3481 0.8973 8.6218 12.9193 41.5351 7.1666 24.6933 1.6505 47.1303 1.8167 73.1314 90.5730 6.4930 40.1601 72.4879 26.2874 171.7157 14.5958 10.1697 10.9236 11.8908 28.2564 3.0111 2.1229 7.1179 15.0662 183.2523 15.7198 19.4989 101.1346 388.6282 6.6782 52.3512 49.5317 1.0962 5.8687 64.4351 6.0657 19.6377 53.5836 24.0745 23.9535 20.4863 0.3304 60.1649 59.4561 42.7784 239.2006 18.8883 34.3736 120.3556 189.7860 31.2865 106.7724 41.4292 67.1040 107.7389 60.0218 64.6270 10.3831 25.7117 25.5729 27.3360 13.3650 3.4941 10.6071 13.7784 22.0127 25.8695 16.8196 2.3526 1.6901 26.5229 25.9669
temp: 298.150 k
press: 1.00000 atm
elementType: 8 8 8 8 7 6 6 6 6 6 6 6 6 6 6 6 6 6 6 6 1 1 1 1 1 1 1 1 1 1 1 1 1 1 1 1 1 1 1
symmnumber: 1
zpe: 817215.0 jmol-1
zpe.correction: 0.311261 hartree
zpe.thermalcorrener: 0.333532 hartree
zpe.thermalcorrenthalpy: 0.334476 hartree
zpe.thermalcorrgfe: 0.257462 hartree
zpe.sumelectzpe: -937.058793 hartree
zpe.sumelectthermal: -937.036522 hartree
zpe.sumelectthermalent: -937.035577 hartree
zpe.sumelectthermalfe: -937.112591 hartree
dipole: 2.6309 4.5651 0.9062
dipole: 5.3463
quadrupole: -95.4399 -120.7465 -115.5160
quadrupole: -11.1840 3.8819 -1.2523
quadrupole: 15.1276 -10.1790 -4.9485 -11.1840 3.8819 -1.2523
hfenergy: -937.3700534 hartree
pointgroup: C01 [X(C15H19N1O4)]
dipole: 1.0605461 -1.7662228 -0.4242535 debye
polarizability: 363.028678|19.7742412|189.2038347|6.2005507|3.4689403|109.8778542 unknown
InChI: InChI=1S/C15H19NO4/c1-5-8-16-14(17)7-6-11-9-12(18-2)15(20-4)13(10-11)19-3/h5-7,9-10,16H,1,8H2,2-4H3
charge 0 multiplicity 1
39 atoms
O  4.536932 -0.426367 0.407793
O  3.637069 2.330657 0.435063
O  2.534057 -2.501056 0.251572
O  -3.741384 1.9575 0.305594
N  -4.530867 -0.236995 0.351658
C  0.378318 0.542196 0.286775
C  3.161597 -0.10953 0.324527
C  2.745166 1.251835 0.318609
C  2.169748 -1.134124 0.243366
C  1.367502 1.561439 0.303304
C  0.802236 -0.815991 0.239439
C  -1.035337 0.941583 0.298279
C  -2.131032 0.125574 0.308802
C  -3.503596 0.705671 0.321484
C  -5.952512 0.148057 0.357574
C  4.928455 -1.057985 1.694752
C  4.764598 2.387481 -0.522414
C  3.35447 -2.938974 -0.902699
C  -6.714376 -0.485049 -0.789468
C  -7.821678 -1.254854 -0.641505
H  1.079587 2.617712 0.32336
H  0.08723 -1.642511 0.193768
H  -1.245943 2.021089 0.301603
H  -2.033672 -0.968725 0.313618
H  -4.300974 -1.232334 0.356648
H  -5.956145 1.252057 0.276171
H  -6.424212 -0.121628 1.323135
H  4.36705 -1.996466 1.849382
H  4.741562 -0.357517 2.528908
H  6.006208 -1.26225 1.604952
H  5.401311 1.491972 -0.436779
H  4.379034 2.48469 -1.555587
H  5.324099 3.293989 -0.246332
H  3.569813 -4.002498 -0.718955
H  2.777664 -2.828054 -1.84047
H  4.291452 -2.357751 -0.96459
H  -6.316464 -0.276078 -1.79328
H  -8.35082 -1.673856 -1.504357
H  -8.237148 -1.478109 0.349701
