program: Gaussian 09
title: 000202372
version: EM64L-G09RevD.01
frameworkgroup: C1[X(C15H26N2O2)]
method: RPBEPBE
basis: SDD
operation: Freq
keyword: #p
keyword: freq=noraman
keyword: PBEPBE/SDD
title: #p freq=noraman PBEPBE/SDD
converged: YES YES NO NO
title: Mulliken charges:
elementType: O O N N C C C C C C C C C C C C C C C H H H H H H H H H H H H H H H H H H H H H H H H H H
charge: -0.322192 -0.286280 -0.390296 -0.388495 -0.074617 -0.071413 -0.408875 -0.404129 -0.403822 -0.403461 -0.416315 -0.418045 -0.419917 -0.421195 -0.381703 -0.380773 0.277789 0.207998 -0.652562 0.262244 0.254569 0.218414 0.199776 0.198874 0.222250 0.212841 0.191257 0.191131 0.213779 0.185402 0.213651 0.213517 0.191500 0.205371 0.202274 0.200089 0.214913 0.197031 0.206782 0.189729 0.201144 0.305136 0.367064 0.236606 0.262957
chargesum: 0.00000
title: Mulliken charges with hydrogens summed into heavy atoms:
elementType: O O N N C C C C C C C C C C C C C C C
charge: -0.322192 -0.286280 -0.085160 -0.021431 0.187627 0.183157 0.009316 0.016995 0.000277 0.001449 -0.017263 -0.013028 -0.012272 -0.006193 0.022110 0.010100 0.277789 0.207998 -0.152998
polarizability: 2.18404934e+02 3.99161138e+00 1.68372925e+02 2.59568882e+00 3.79425845e+00 1.49336871e+02
1716.lowfreq: -41.2654 -18.8721 -9.6166 -3.8563 -0.0007 -0.0006 -0.0003 12.5618 17.7485
frequency: -36.3460 7.2350 14.1086 46.0755 60.5747 63.1154 73.1247 109.6874 142.2811 203.1693 212.5646 216.9643 223.7069 255.7515 288.4630 334.0536 353.4046 379.3273 386.7685 406.4920 415.8432 460.1170 468.3862 470.9367 471.1768 535.7206 578.4718 611.0740 614.0763 616.6893 632.6070 738.1495 766.3008 772.9450 791.8225 801.7926 802.6785 826.6042 829.8662 858.7536 861.2217 864.4496 868.8301 918.4914 923.0415 924.5808 927.7239 947.0509 984.7185 1011.7258 1015.0909 1021.8108 1042.1917 1045.1432 1054.0397 1058.0253 1086.9146 1089.9579 1115.4250 1116.2434 1141.2940 1150.4091 1152.4678 1153.1283 1156.8705 1221.5718 1234.5991 1241.0370 1243.9003 1260.2250 1261.7410 1266.9657 1268.3333 1294.3122 1303.0959 1303.6337 1325.0818 1330.3016 1330.7113 1332.3578 1334.6104 1335.0022 1351.7244 1352.1042 1357.1407 1358.6255 1359.8706 1360.7941 1432.0587 1452.2568 1452.6619 1457.9686 1458.3869 1469.0672 1469.9010 1471.8824 1472.9967 1474.7953 1483.0088 1493.2814 1526.5898 1589.5117 1635.6382 2957.7022 2960.9071 2962.3100 2970.0719 2970.0930 2971.3037 2972.9323 2977.3371 2979.5969 2983.3989 2999.9307 3026.9293 3028.0090 3030.2712 3032.2937 3035.2023 3038.4816 3040.1249 3042.2833 3046.3228 3048.3770 3048.5694 3052.1576 3084.2542 3349.1381 3552.3721
redmass: 3.9119 3.8309 3.8515 5.4855 3.7558 5.2942 3.7271 3.0085 3.7275 4.2126 2.2245 2.3596 3.3000 2.6114 3.6218 2.0700 2.2544 2.4571 2.7552 2.7410 2.2716 2.4702 2.1955 2.3315 2.1428 3.2993 1.4089 3.4232 2.7432 3.1262 2.8044 5.4387 1.3018 1.4961 1.3407 3.3079 3.3763 1.6328 1.5933 2.5122 2.5114 2.6242 2.3285 2.4559 1.3987 2.4414 1.4340 2.7553 2.5445 2.7723 2.7658 2.4233 1.4513 1.4373 1.7860 1.8930 1.7953 1.7953 1.0799 1.0787 1.6842 2.1243 1.7728 1.6290 1.6596 1.5945 1.6912 1.3455 1.6855 1.2338 1.2354 1.2690 1.2733 1.4757 1.6037 1.5965 1.5292 1.3340 1.3298 1.6598 1.4333 1.4372 1.3811 1.3946 1.4760 1.4096 1.4077 1.4307 1.1104 1.0850 1.0847 1.0906 1.0906 1.1522 1.0863 1.1012 1.3548 1.0850 1.1316 1.3554 1.7804 4.9313 5.7795 1.0668 1.0673 1.0637 1.0627 1.0611 1.0621 1.0634 1.0637 1.0622 1.0628 1.0632 1.0944 1.0981 1.0947 1.0931 1.0981 1.1005 1.0886 1.1010 1.1012 1.0886 1.0997 1.1020 1.0976 1.0806 1.0769
irintensity: 0.1386 0.1429 1.5170 3.8692 2.4787 4.3268 0.7423 7.5142 5.8553 2.6352 0.9560 2.0037 8.0682 2.3320 28.8160 1.7111 0.4581 0.5009 1.0895 13.2176 5.1785 6.6166 0.2745 0.2699 1.0256 6.0610 67.7143 4.9442 5.1610 8.1482 11.0893 6.3974 55.9840 0.0335 48.3613 1.3079 0.9261 1.2594 5.4723 12.0276 7.7359 7.9269 9.8155 7.2050 11.8733 10.7461 29.0019 20.5052 1.0329 11.4307 3.4216 1.2192 2.3512 1.0932 0.2009 1.3294 0.3819 0.2347 1.1042 0.7287 2.3277 46.0509 2.5563 10.9530 25.4856 12.1521 5.3663 7.7998 65.5956 0.9845 0.6651 10.4480 18.4506 1.8302 0.3703 0.4224 31.4364 0.0084 3.6888 27.9732 0.2125 0.2276 0.1378 1.3232 13.7730 1.9447 6.0026 2.9046 38.1547 5.9921 11.2916 10.9068 1.0599 58.9611 5.3405 44.7525 329.5916 7.9454 20.7848 236.0163 318.0825 63.2453 315.9181 25.7730 28.3413 38.0038 28.9557 40.8204 23.9309 18.6596 41.9807 12.4192 38.0689 3.1677 73.1889 72.3649 70.3003 71.7626 10.2256 32.8864 41.5756 21.6288 24.5714 43.6452 90.0049 82.3083 11.9112 187.1539 24.9214
temp: 298.150 k
press: 1.00000 atm
elementType: 8 8 7 7 6 6 6 6 6 6 6 6 6 6 6 6 6 6 6 1 1 1 1 1 1 1 1 1 1 1 1 1 1 1 1 1 1 1 1 1 1 1 1 1 1
symmnumber: 1
zpe: 1040750.2 jmol-1
zpe.correction: 0.396401 hartree
zpe.thermalcorrener: 0.414664 hartree
zpe.thermalcorrenthalpy: 0.415608 hartree
zpe.thermalcorrgfe: 0.346719 hartree
zpe.sumelectzpe: -845.692582 hartree
zpe.sumelectthermal: -845.674319 hartree
zpe.sumelectthermalent: -845.673375 hartree
zpe.sumelectthermalfe: -845.742264 hartree
dipole: 3.8611 -2.0254 -0.6608
dipole: 4.4098
quadrupole: -97.8754 -126.7830 -118.2320
quadrupole: 7.1208 1.4757 -7.8620
quadrupole: 16.4214 -12.4862 -3.9352 7.1208 1.4757 -7.8620
hfenergy: -846.0889827 hartree
pointgroup: C01 [X(C15H26N2O2)]
dipole: 1.4338451 -0.3608846 -0.9077149 debye
polarizability: 218.836979|-0.5593135|153.5519121|0.09333|8.6944106|163.7258394 unknown
InChI: InChI=1S/C15H26N2O2/c18-14(16-12-7-3-1-4-8-12)11-15(19)17-13-9-5-2-6-10-13/h12-13,16-17H,1-11H2
charge 0 multiplicity 1
45 atoms
O  -0.103064 0.971291 -0.994888
O  -1.368077 1.708362 3.064947
N  1.980324 0.960517 0.042855
N  -2.109063 1.112189 0.920741
C  2.664496 0.181821 -1.017275
C  -3.423606 0.574138 1.331371
C  3.879668 0.965302 -1.581654
C  3.106942 -1.210171 -0.488558
C  -4.574824 1.311648 0.595934
C  -3.502855 -0.954797 1.063013
C  5.046701 1.061192 -0.568047
C  4.272905 -1.117389 0.526057
C  -4.608789 0.988794 -0.918142
C  -3.528266 -1.282174 -0.450307
C  5.474107 -0.339596 -0.065474
C  -4.683098 -0.538473 -1.165811
C  0.649432 1.30579 -0.013789
C  -1.19054 1.609372 1.810306
C  0.123867 2.128425 1.165335
H  1.904533 0.050391 -1.807767
H  -3.495553 0.762454 2.417924
H  3.553088 1.971986 -1.903377
H  4.234245 0.433278 -2.487392
H  3.434006 -1.814639 -1.358697
H  2.236967 -1.727181 -0.04257
H  -4.478852 2.401065 0.762455
H  -5.533062 0.992712 1.054792
H  -4.430843 -1.338516 1.534418
H  -2.651818 -1.458096 1.559319
H  4.749274 1.68926 0.298905
H  5.905182 1.578446 -1.037111
H  4.586507 -2.13514 0.82643
H  3.928771 -0.616593 1.455698
H  -3.702057 1.396646 -1.41074
H  -5.473276 1.495267 -1.389172
H  -3.630743 -2.375091 -0.594603
H  -2.561608 -0.994618 -0.912317
H  5.894098 -0.915567 -0.915844
H  6.280114 -0.247178 0.687598
H  -5.652838 -0.921563 -0.784282
H  -4.659163 -0.750722 -2.252243
H  2.522933 1.243218 0.860685
H  -1.794158 1.034145 -0.060185
H  0.86058 2.21192 1.981213
H  -0.078995 3.152978 0.795352
