program: Gaussian 09
title: 000202331
version: EM64L-G09RevD.01
frameworkgroup: C1[X(C13H20N)]
method: RPBEPBE
basis: SDD
operation: Freq
keyword: #p
keyword: freq=noraman
keyword: PBEPBE/SDD
title: #p freq=noraman PBEPBE/SDD
converged: YES YES NO NO
title: Mulliken charges:
elementType: N C C C C C C C C C C C C C H H H H H H H H H H H H H H H H H H H H
charge: -0.081383 -0.370113 -0.370138 -0.208430 -0.501070 -0.500578 -0.561644 -0.542054 0.550594 -0.459331 -0.394820 -0.212677 -0.240341 -0.231336 0.270264 0.261748 0.261914 0.270298 0.222451 0.276407 0.248248 0.249678 0.276232 0.277908 0.265563 0.265691 0.265808 0.266646 0.265849 0.235823 0.208993 0.244548 0.240059 0.249190
chargesum: 1.00000
title: Mulliken charges with hydrogens summed into heavy atoms:
elementType: N C C C C C C C C C C C C C
charge: -0.081383 0.161899 0.162075 0.014021 0.023586 0.025333 0.247518 0.256250 0.550594 -0.223508 -0.185828 0.031872 -0.000282 0.017853
polarizability: 1.83240954e+02 -6.39213824e-01 1.30062055e+02 2.87792849e-01 -2.89535288e-01 9.63273249e+01
1716.lowfreq: -8.7795 -0.0006 -0.0004 0.0003 6.3229 22.3372 41.0917 55.9430 89.5859
frequency: 40.6920 55.8496 89.5657 164.0585 178.4815 226.3704 233.8987 255.8321 275.2840 311.4752 316.2805 376.5628 404.5477 421.4823 427.0455 471.5727 472.6201 523.9753 532.1815 616.7989 638.8325 671.7965 708.4756 767.8268 771.1789 789.8182 851.5278 864.0001 868.3488 889.5374 921.6698 936.0195 951.3637 979.4082 989.9540 996.2431 1007.2473 1028.2857 1028.9600 1045.0685 1061.9072 1086.6832 1088.1576 1104.7697 1157.7044 1169.6094 1180.0245 1192.3999 1193.0034 1198.3987 1212.0606 1263.0464 1268.5483 1278.0527 1313.9873 1314.9347 1337.9523 1348.9821 1355.4383 1365.4424 1372.6341 1386.9023 1419.3828 1441.5857 1445.4902 1452.3818 1453.8276 1459.0083 1472.6985 1473.9781 1483.2940 1484.3084 1486.7374 1498.6808 1595.3311 1612.9417 2967.5954 3008.7945 3011.4436 3014.3343 3017.4325 3022.1381 3032.1040 3063.3283 3067.0322 3087.9419 3092.9544 3103.5006 3120.2174 3137.9522 3141.6178 3142.2880 3144.1420 3155.2881 3161.1791 3173.7116
redmass: 3.5287 3.4211 3.5715 1.1455 3.3788 4.8416 1.2498 2.2084 1.7078 2.2641 2.3740 2.5423 2.8018 2.2802 2.1369 3.0439 2.5311 2.8920 3.1544 6.4163 4.1770 3.4682 1.7316 1.6736 1.8265 2.4925 1.2489 2.1297 3.2454 3.0765 1.4282 1.4300 2.4630 1.3892 4.7529 2.3612 1.3292 2.2204 2.1166 2.1261 1.6604 1.2567 1.5395 2.1172 1.8827 1.3958 1.0577 1.1203 1.5007 1.6099 2.1628 1.3531 1.6670 1.4394 1.2407 1.4278 1.2655 1.3314 1.3030 1.5207 1.3624 4.9497 1.1515 1.1894 1.9967 1.0670 1.0734 1.0697 1.0580 1.1046 1.2426 1.1883 1.4734 1.0571 5.9525 6.1476 1.0837 1.0610 1.0617 1.0595 1.0570 1.0355 1.0342 1.1007 1.1009 1.1071 1.1076 1.0889 1.0893 1.1054 1.1050 1.1050 1.0890 1.0950 1.1037 1.1012
irintensity: 0.5521 0.5344 0.9571 0.0911 0.9551 3.8310 0.2278 0.6960 0.3792 0.0430 0.0530 0.2557 0.0002 0.1052 0.1192 1.0479 0.4435 1.3761 13.8693 0.0352 0.9515 0.7318 50.2685 5.2964 47.5655 5.6955 0.1500 5.4997 0.5457 51.2626 8.1190 9.9804 13.5986 0.4199 1.7211 7.7229 0.0896 9.1557 3.0818 0.3897 3.1539 0.2995 7.5218 0.0414 3.1676 0.4124 0.0138 0.2319 3.0199 1.7950 2.4877 9.5486 3.6678 6.4422 0.2186 3.9391 0.8663 0.1492 0.1774 1.3280 1.6310 0.0460 13.8733 12.8695 7.4117 1.6726 2.4424 12.6419 25.6314 33.4945 10.7037 81.8097 6.1877 32.8833 3.2098 2.5029 14.8587 5.7118 11.6088 7.2976 9.8560 11.5776 5.3759 5.4283 13.2941 2.7708 14.8598 28.8279 10.1627 0.6676 4.9786 5.7332 1.8118 20.3073 4.4126 11.5268
temp: 298.150 k
press: 1.00000 atm
elementType: 7 6 6 6 6 6 6 6 6 6 6 6 6 6 1 1 1 1 1 1 1 1 1 1 1 1 1 1 1 1 1 1 1 1
symmnumber: 1
zpe: 800274.3 jmol-1
zpe.correction: 0.304808 hartree
zpe.thermalcorrener: 0.317995 hartree
zpe.thermalcorrenthalpy: 0.318940 hartree
zpe.thermalcorrgfe: 0.265423 hartree
zpe.sumelectzpe: -560.821586 hartree
zpe.sumelectthermal: -560.808399 hartree
zpe.sumelectthermalent: -560.807455 hartree
zpe.sumelectthermalfe: -560.860972 hartree
dipole: 10.2740 0.1209 -0.0230
dipole: 10.2747
quadrupole: -30.3009 -71.5593 -80.1356
quadrupole: 0.9691 0.0154 -0.0867
quadrupole: 30.3644 -10.8941 -19.4703 0.9691 0.0154 -0.0867
hfenergy: -561.1263949 hartree
pointgroup: C01 [X(C13H20N1)]
dipole: 4.0417242 0.0690033 0.0230315 debye
polarizability: 183.2472908|-0.3020146|119.0063334|-0.1802244|15.8336217|107.3767088 unknown
InChI: InChI=1S/C13H20N/c1-14(2)10-8-13(9-11-14)12-6-4-3-5-7-12/h3-7,13H,8-11H2,1-2H3
charge 1 multiplicity 1
34 atoms
N  3.024273 0.080985 0.053292
C  2.291995 -1.050291 0.822105
C  2.279669 0.347831 -1.281357
C  0.062906 -0.503488 -0.317013
C  0.797221 -0.765521 1.027356
C  0.785334 0.638963 -1.08391
C  3.095948 1.350157 0.895826
C  4.446966 -0.375003 -0.258119
C  -1.426503 -0.219807 -0.122622
C  -2.395293 -1.067372 -0.715501
C  -1.869073 0.889724 0.644432
C  -3.775748 -0.815254 -0.547712
C  -3.24739 1.144184 0.814293
C  -4.205449 0.291631 0.217992
H  2.828088 -1.181315 1.778376
H  2.431496 -1.961111 0.211772
H  2.420105 -0.5662 -1.886267
H  2.806283 1.182568 -1.776258
H  0.154635 -1.424451 -0.930805
H  0.360934 -1.652241 1.523085
H  0.642007 0.076048 1.727342
H  0.628856 1.608374 -0.576483
H  0.339253 0.751824 -2.089268
H  2.084607 1.699502 1.137682
H  3.642691 1.12948 1.825484
H  3.627869 2.126304 0.324333
H  4.977694 -0.576747 0.68527
H  4.408346 -1.292156 -0.865404
H  4.967694 0.418324 -0.816492
H  -2.071517 -1.929598 -1.312063
H  -1.144466 1.566132 1.117451
H  -4.512044 -1.479499 -1.012075
H  -3.575608 2.003481 1.408646
H  -5.274377 0.48874 0.349311
