program: Gaussian 09
title: 000202441
version: EM64L-G09RevD.01
frameworkgroup: C1[X(C24H26N4O5)]
method: RPBEPBE
basis: SDD
operation: Freq
keyword: #p
keyword: freq=noraman
keyword: PBEPBE/SDD
title: #p freq=noraman PBEPBE/SDD
converged: YES YES NO NO
title: Mulliken charges:
elementType: O O O O O N N N N C C C C C C C C C C C C C C C C C C C C C C C C H H H H H H H H H H H H H H H H H H H H H H H H H H
charge: -0.271517 -0.274734 -0.281941 -0.406514 -0.259682 -0.154878 -0.257831 -0.383918 -0.405937 -0.223968 0.051797 -0.390766 0.355949 0.146239 0.066105 -0.491804 0.455209 -0.775644 -0.633971 0.199959 -0.646379 -0.358324 -0.386321 0.210944 0.433430 -0.214677 -0.211359 -0.250567 -0.404328 -0.388958 -0.218186 -0.218826 -0.238432 0.278795 0.236762 0.265401 0.334898 0.380018 0.258729 0.277284 0.206048 0.302058 0.279456 0.268762 0.245505 0.235872 0.245457 0.243752 0.283013 0.263344 0.229755 0.228189 0.230908 0.239768 0.236738 0.227716 0.227569 0.374998 0.229034
chargesum: 0.00000
title: Mulliken charges with hydrogens summed into heavy atoms:
elementType: O O O O O N N N N C C C C C C C C C C C C C C C C C C C C C C C C
charge: -0.271517 -0.274734 -0.281941 -0.031515 -0.259682 -0.154878 -0.257831 -0.049020 -0.025920 0.054827 0.051797 0.111397 0.355949 0.146239 0.066105 0.044209 0.455209 0.011918 0.116170 0.199959 -0.157170 -0.075311 -0.122977 0.210944 0.433430 0.015077 0.016830 -0.019658 -0.164560 -0.152221 0.009529 0.008744 -0.009398
polarizability: 4.05180079e+02 -1.72083374e+01 2.93873665e+02 1.48212769e+01 3.13237785e+01 2.28996590e+02
1716.lowfreq: -10.1890 -7.6058 -5.3066 -0.0006 -0.0004 0.0007 0.5408 5.6700 18.2552
frequency: -6.3742 -2.1885 18.1650 21.3940 29.7946 31.3832 39.4536 43.2388 52.5550 62.4182 69.3650 84.5853 87.5943 93.2241 109.6150 116.3642 133.9652 139.9417 149.5774 164.4107 169.5427 180.3283 227.2188 238.9633 253.3753 263.8380 271.6902 280.4880 295.3464 319.3714 324.4122 334.5904 359.4572 377.0903 402.9946 408.2867 410.5887 423.7822 436.7679 463.8144 484.5491 500.5836 516.1899 563.4723 573.2876 577.3675 585.4959 612.6757 615.3985 618.0931 620.7489 630.8741 635.7830 645.5037 651.7676 679.3365 694.5138 704.1009 707.3540 720.6716 725.2113 738.2952 762.9989 764.4734 798.2339 808.7853 828.1869 843.1283 857.1834 879.6526 910.1860 912.2470 918.5351 919.9954 923.5547 934.7073 965.5080 971.4921 979.7540 985.9009 989.8193 991.3421 996.7939 998.9602 1012.7903 1026.7271 1033.3361 1044.8327 1050.2490 1062.3330 1080.7552 1081.6963 1101.2913 1107.7755 1121.8282 1139.5133 1145.5137 1168.6699 1172.5851 1174.3741 1186.0005 1187.4167 1188.6667 1191.8422 1208.3705 1211.6140 1224.4237 1241.4534 1260.6648 1281.8645 1287.2294 1291.6652 1318.8199 1326.8115 1338.5430 1340.0680 1362.4012 1370.8421 1379.2897 1380.9984 1385.1455 1410.4953 1432.9927 1434.3284 1439.9747 1444.4648 1448.8301 1450.9595 1454.0581 1468.7144 1473.6709 1480.1917 1483.7796 1485.7899 1497.4446 1531.5623 1588.7556 1589.7026 1593.3799 1605.4173 1609.8441 1614.9533 1626.1491 1652.8812 1663.1469 2978.7995 2987.6929 2994.2543 2998.8030 3004.2635 3015.6354 3051.3600 3068.9552 3077.8531 3078.7683 3089.0521 3104.0463 3116.9694 3119.1082 3129.5400 3130.5792 3134.1282 3140.5145 3146.8228 3153.9564 3164.5986 3166.4877 3187.6509 3458.9426 3462.9673 3515.8421
redmass: 4.8963 5.5799 6.1929 4.8834 5.5755 4.3390 6.5040 5.2230 5.6376 4.2894 6.4269 6.5058 4.2851 4.4207 4.3600 1.3238 3.1853 5.2070 2.6124 1.6942 6.3843 3.5546 4.3158 3.0273 4.3022 5.6173 3.6475 4.8656 4.2397 2.2681 4.5667 3.1710 4.4466 5.5014 2.8258 2.9539 5.2995 4.1068 4.6773 3.0115 2.3274 3.3633 3.2628 4.1143 5.2538 4.7374 5.2439 5.8902 5.4423 6.2617 4.8681 2.4737 2.0085 4.6168 2.5133 2.0103 2.4325 3.3374 1.7658 2.4616 1.5038 3.0405 1.8085 2.0346 4.0354 5.1982 3.7942 1.2531 1.2469 4.3598 1.8869 3.0875 2.2068 1.9251 1.8412 2.6376 2.2350 1.3660 1.3877 4.4074 6.1838 1.4293 1.3160 2.6870 3.1763 2.1953 1.9484 2.5559 1.5019 2.5203 1.6998 1.6724 1.9550 2.1242 3.4134 2.2173 2.5298 1.1587 1.0525 1.0681 1.2386 2.3696 1.1207 1.3232 1.4043 1.9254 1.8072 2.1811 1.6457 1.3249 1.5701 3.0732 1.5307 1.2721 2.2537 2.4156 1.4721 2.9416 1.8647 8.1708 8.2865 1.2786 1.1730 1.0982 2.1752 2.0409 1.2032 1.1256 1.0909 1.1800 1.7223 1.1265 2.3158 2.2076 1.1171 2.1324 7.5514 6.6120 6.8879 7.2145 6.1077 6.3069 8.8698 8.5235 7.7628 1.0421 1.0827 1.0364 1.0624 1.0628 1.0631 1.0955 1.0980 1.1030 1.0969 1.0923 1.1002 1.0875 1.0873 1.0869 1.0993 1.0907 1.0892 1.0958 1.0941 1.1015 1.0993 1.0965 1.0774 1.0762 1.0640
irintensity: 0.0291 0.0175 0.1455 0.1802 0.2785 0.5287 0.6002 0.3074 1.9136 1.4319 6.1190 1.9540 9.9863 8.3920 2.3781 0.7743 8.6720 2.8104 7.5535 4.0925 7.0876 0.4429 3.5534 3.0223 3.4135 9.7895 2.4970 3.1145 6.5573 0.6624 5.5429 5.2734 14.7267 4.2720 0.0204 0.3479 16.8678 20.8845 8.6219 23.6148 57.2938 8.7968 30.5567 10.4403 10.6510 13.1723 4.4284 4.6418 9.0812 11.1223 14.2316 21.4505 99.4941 7.9429 12.0888 56.1818 14.8858 28.7309 57.5078 9.2209 128.5173 25.8742 71.5557 11.2546 3.5647 4.8823 3.2296 0.7179 0.0772 4.4643 5.1956 22.0289 13.1232 1.3150 2.5161 26.5318 45.3930 0.7803 0.4404 0.3379 0.1815 0.4466 0.8723 3.7697 33.7695 4.7164 1.3333 195.4463 23.4523 9.0276 10.9808 23.9399 15.0427 26.5480 2.9324 13.9935 41.1948 6.5870 0.2057 1.2157 1.5093 2.4639 0.9227 8.3630 14.2335 0.9295 11.6435 47.4633 12.9240 34.9791 10.2238 105.9248 56.2979 0.3409 50.2875 103.0600 6.0360 189.1265 49.0781 0.3340 4.2773 48.7552 17.9612 10.2909 6.7922 19.0003 204.4809 3.6460 29.3638 245.6396 318.2241 42.8068 15.6449 82.2987 12.4804 223.1591 200.6758 11.7438 132.2650 45.4488 131.6879 29.5112 200.6797 53.0639 242.0885 55.0571 18.8691 25.5477 13.3264 13.3819 18.0565 3.1954 4.5139 9.1991 7.1405 11.8055 17.1640 5.9383 5.8684 5.2497 8.3282 8.8976 11.4382 35.8718 25.8604 19.8138 22.4523 1.7855 60.8039 73.3093 20.2283
temp: 298.150 k
press: 1.00000 atm
elementType: 8 8 8 8 8 7 7 7 7 6 6 6 6 6 6 6 6 6 6 6 6 6 6 6 6 6 6 6 6 6 6 6 6 1 1 1 1 1 1 1 1 1 1 1 1 1 1 1 1 1 1 1 1 1 1 1 1 1 1
symmnumber: 1
zpe: 1220664.6 jmol-1
zpe.correction: 0.464927 hartree
zpe.thermalcorrener: 0.495096 hartree
zpe.thermalcorrenthalpy: 0.496040 hartree
zpe.thermalcorrgfe: 0.400754 hartree
zpe.sumelectzpe: -1522.917212 hartree
zpe.sumelectthermal: -1522.887042 hartree
zpe.sumelectthermalent: -1522.886098 hartree
zpe.sumelectthermalfe: -1522.981384 hartree
dipole: 1.1943 5.8974 3.0617
dipole: 6.7513
quadrupole: -175.3256 -188.7723 -188.3663
quadrupole: -1.3842 5.8562 -5.6289
quadrupole: 8.8291 -4.6176 -4.2115 -1.3842 5.8562 -5.6289
hfenergy: -1523.3821384 hartree
pointgroup: C01 [X(C24H26N4O5)]
dipole: -1.2272344 -0.3964814 2.3220304 debye
polarizability: 387.0126809|-38.9898655|233.2892509|26.2599882|-36.2950144|307.7484019 unknown
InChI: InChI=1S/C24H26N4O5/c1-16-22(24(33)28(27(16)2)18-11-7-4-8-12-18)26-23(32)19(13-14-21(30)31)25-20(29)15-17-9-5-3-6-10-17/h3-12,19,25-26,30H,13-15H2,1-2H3
charge 0 multiplicity 1
59 atoms
O  0.7291 -0.020213 0.694375
O  -2.401833 1.133595 -3.032716
O  4.533902 -0.211327 -2.433245
O  1.658491 -3.968826 1.744357
O  0.038999 -3.246287 0.25178
N  -3.788749 0.300542 0.14666
N  -3.884418 0.930336 -1.138921
N  -0.461996 -0.206478 -1.317912
N  3.094043 -0.061757 -0.621107
C  1.95553 -0.637889 -1.344873
C  -1.763492 0.111516 -0.88318
C  2.114291 -2.180365 -1.567613
C  -2.459696 -0.180775 0.280424
C  0.685523 -0.262697 -0.554026
C  -2.643677 0.795615 -1.831211
C  2.448133 -2.990003 -0.301016
C  -5.157229 1.199184 -1.726946
C  -2.033588 -0.927085 1.508492
C  -4.42207 1.050356 1.263285
C  4.316606 0.12351 -1.225495
C  5.409891 0.805349 -0.371154
C  -5.250928 2.19721 -2.730501
C  -6.307817 0.466387 -1.335897
C  1.249958 -3.377727 0.541367
C  5.23829 0.701384 1.135282
C  -6.500089 2.458246 -3.331103
C  -7.55355 0.753652 -1.933277
C  -7.657724 1.749697 -2.931588
C  4.656046 1.757737 1.882423
C  5.63795 -0.475255 1.823577
C  4.474956 1.643235 3.280163
C  5.458873 -0.593493 3.219269
C  4.8750 0.466358 3.952905
H  1.920383 -0.182643 -2.355135
H  1.193991 -2.573298 -2.03766
H  2.942454 -2.295183 -2.2889
H  -0.365126 -0.221469 -2.340985
H  2.921465 0.210958 0.354913
H  2.957734 -3.934071 -0.577094
H  3.164387 -2.445667 0.342285
H  -2.893449 -1.181586 2.149938
H  -1.533588 -1.863186 1.203191
H  -1.28689 -0.352643 2.083511
H  -5.483142 1.229999 1.033856
H  -3.917129 2.02065 1.43623
H  -4.357714 0.437892 2.175021
H  6.363265 0.355515 -0.699459
H  5.438199 1.865132 -0.689766
H  -4.352055 2.734461 -3.041613
H  -6.213355 -0.341172 -0.602458
H  -6.568231 3.224185 -4.111288
H  -8.439561 0.185111 -1.629451
H  -8.625217 1.96497 -3.397474
H  4.347682 2.676364 1.367879
H  6.098796 -1.297231 1.261195
H  4.023958 2.469782 3.840523
H  5.774892 -1.507599 3.73443
H  0.85531 -4.224492 2.274152
H  4.736311 0.37599 5.035982
