program: Gaussian 09
title: 000202373
version: EM64L-G09RevD.01
frameworkgroup: C1[X(C20H19ClN2O)]
method: RPBEPBE
basis: SDD
operation: Freq
keyword: #p
keyword: freq=noraman
keyword: PBEPBE/SDD
title: #p freq=noraman PBEPBE/SDD
converged: YES YES NO NO
title: Mulliken charges:
elementType: Cl O N N C C C C C C C C C C C C C C C C C C C C H H H H H H H H H H H H H H H H H H H
charge: -0.057035 -0.238253 -0.055185 -0.242979 -0.361815 -0.419248 0.243332 -0.546234 0.367009 0.245257 -0.493661 0.313335 0.106429 -0.373434 -0.315098 -0.391619 -0.365798 -0.461613 -0.255916 -0.245784 -0.161901 -0.243416 -0.010528 -0.565112 0.274427 0.214282 0.228105 0.242081 0.213544 0.217003 0.262446 0.247213 0.290585 0.234981 0.242358 0.209375 0.269686 0.230021 0.228084 0.258718 0.233201 0.221167 0.211991
chargesum: 0.00000
title: Mulliken charges with hydrogens summed into heavy atoms:
elementType: Cl O N N C C C C C C C C C C C C C C C C C C C C
charge: -0.057035 -0.238253 -0.055185 -0.242979 -0.087388 0.023139 0.243332 -0.090609 0.367009 0.245257 -0.014212 0.313335 0.106429 -0.126221 -0.024513 -0.156638 -0.123440 0.017448 -0.025895 -0.017700 -0.161901 0.015303 0.222673 -0.131955
polarizability: 2.67205390e+02 -1.94103097e+00 2.41760136e+02 1.45357015e+00 2.11979313e+01 1.97805349e+02
1716.lowfreq: -6.1700 -0.0018 -0.0017 -0.0015 2.2298 5.3017 10.4734 43.9347 44.9043
frequency: 4.8305 43.9108 44.8857 49.4165 66.3583 85.3176 94.4519 120.1309 147.0963 162.8402 191.3125 221.5031 233.9923 239.6249 285.7313 300.8071 316.5938 327.4174 335.0793 351.4475 392.1866 408.5782 419.5370 436.0827 456.1372 476.4192 479.3369 507.0251 514.6443 528.1000 568.3762 575.0304 613.8697 629.1860 650.3505 674.2328 694.1603 727.9368 742.4875 750.6420 756.1894 784.3258 810.9180 821.1656 853.5543 868.6810 880.2463 891.9647 909.3119 918.4179 931.4542 946.3283 952.1937 957.6264 970.8230 989.5985 991.8088 1001.1345 1007.2945 1036.7255 1055.6860 1057.5786 1081.7419 1091.9777 1116.1186 1128.5212 1132.5683 1138.3371 1166.6339 1175.2765 1192.2396 1202.4868 1214.3608 1221.1733 1236.6092 1251.2036 1251.7457 1264.8686 1275.4306 1283.5950 1300.6625 1320.4137 1330.5495 1342.9534 1350.0607 1355.1781 1373.5288 1385.4497 1386.6806 1404.5971 1429.1660 1441.0804 1444.5824 1463.4893 1466.0024 1467.0785 1481.1213 1491.0470 1572.0566 1589.8773 1594.6489 1605.1328 1615.7282 1659.8234 2863.8109 2872.9925 2972.6240 2981.3415 3003.0387 3033.4465 3038.3259 3061.6974 3065.8181 3087.8945 3104.2494 3115.0185 3119.2007 3139.7082 3148.8213 3159.8829 3161.5008 3175.1138 3199.1537
redmass: 3.6968 4.2243 5.4503 5.3825 6.0268 2.7922 6.1169 4.7295 3.9598 4.0639 4.6019 3.6984 4.5581 2.8885 3.9655 3.7834 7.0581 4.3095 3.4542 3.9254 3.7262 4.0446 2.6692 2.9231 3.2211 4.4766 3.8757 3.9332 4.2540 4.1320 3.1032 4.1549 2.6401 5.2909 4.5182 3.7440 3.8435 4.4636 4.7310 1.5542 3.8220 2.4677 2.3516 1.6023 3.0797 2.3732 1.5910 1.8835 2.1896 2.2303 2.3383 1.3670 1.3214 1.4461 2.2025 1.3278 1.9203 1.7861 1.6997 2.4618 2.2649 2.9858 1.9980 2.7663 3.1335 2.3362 2.3576 1.9051 1.7215 1.0667 1.3256 1.6014 1.7537 1.7115 1.8572 1.3755 1.6615 1.7519 1.3708 1.2516 1.4582 1.3502 1.7767 1.5602 1.7532 1.6845 3.9904 6.0146 1.5461 3.6213 1.1883 2.2040 1.1633 1.6940 1.1231 1.3949 1.0965 2.4962 7.9840 7.5571 7.0194 8.2050 6.3950 4.6276 1.0709 1.0704 1.0825 1.0605 1.0583 1.0906 1.0988 1.1023 1.0888 1.0610 1.0945 1.0867 1.0894 1.0929 1.0887 1.0920 1.1004 1.0968 1.1142
irintensity: 0.0616 0.1414 0.1283 0.6209 2.5467 0.1371 1.5648 1.2419 0.0912 0.3017 0.6817 0.8663 0.6058 4.6094 1.4632 4.7722 3.9770 1.9286 5.6343 2.8722 1.7397 4.6230 1.4032 2.9551 8.5440 4.8943 15.0833 3.3010 6.6390 22.2419 3.9322 4.3841 9.8054 12.2392 2.5953 12.0534 3.2155 0.7955 12.9914 69.3404 15.6280 4.5225 9.3511 30.2375 30.8378 9.0820 2.2907 4.1119 10.6122 2.7817 1.0474 3.2954 83.9247 2.0414 10.2816 0.3993 15.5535 9.6743 20.0755 5.3703 5.4585 7.8966 16.6620 16.3895 49.7485 20.8548 17.4849 16.3824 14.3699 1.7320 42.6706 1.7097 11.5206 1.3695 5.6495 18.0114 7.5718 48.7069 12.5912 2.5453 11.9361 7.1898 41.7913 2.0099 9.5485 8.7885 18.2384 0.6992 14.7477 34.8090 5.9392 4.5041 15.2716 65.9213 71.2884 56.5716 7.4533 18.6523 8.4825 103.3842 7.0315 232.2384 1.7458 10.8914 31.0505 91.8746 11.6450 26.6038 33.9315 38.8367 23.6070 7.5231 15.4798 12.0705 6.9138 12.7053 2.7666 25.4246 8.0421 0.8207 30.0847 4.6207 20.3493
temp: 298.150 k
press: 1.00000 atm
elementType: 17 8 7 7 6 6 6 6 6 6 6 6 6 6 6 6 6 6 6 6 6 6 6 6 1 1 1 1 1 1 1 1 1 1 1 1 1 1 1 1 1 1 1
symmnumber: 1
zpe: 896359.0 jmol-1
zpe.correction: 0.341405 hartree
zpe.thermalcorrener: 0.361953 hartree
zpe.thermalcorrenthalpy: 0.362897 hartree
zpe.thermalcorrgfe: 0.289780 hartree
zpe.sumelectzpe: -1416.589480 hartree
zpe.sumelectthermal: -1416.568932 hartree
zpe.sumelectthermalent: -1416.567988 hartree
zpe.sumelectthermalfe: -1416.641105 hartree
dipole: -0.3608 1.9279 0.0671
dipole: 1.9625
quadrupole: -133.5536 -169.8501 -138.3153
quadrupole: 15.1815 3.1119 2.1495
quadrupole: 13.6860 -22.6104 8.9244 15.1815 3.1119 2.1495
hfenergy: -1416.930885 hartree
pointgroup: C01 [X(C20H19Cl1N2O1)]
dipole: -0.0806675 -0.7556129 0.1368095 debye
polarizability: 266.7331613|3.1910137|248.9429104|-3.896654|9.924631|191.0948036 unknown
InChI: InChI=1S/C20H19ClN2O/c1-2-10-23-18-8-7-15(21)12-17(18)20-16-6-4-3-5-14(16)9-11-22(20)13-19(23)24/h2-8,12,20H,1,9-11,13H2
charge 0 multiplicity 1
43 atoms
Cl -0.097194 -4.347937 1.822662
O  2.366106 3.262652 0.213856
N  -0.607346 1.734594 0.926871
N  2.367861 0.927244 0.10465
C  -0.497142 0.659686 -0.110996
C  -1.655804 1.469085 1.942306
C  -1.869048 0.233791 -0.62876
C  -3.035455 1.489916 1.265529
C  0.364403 -0.51528 0.39189
C  -3.070558 0.606359 0.02815
C  0.696654 2.068215 1.562782
C  1.777497 -0.331796 0.483214
C  1.856651 2.157266 0.562832
C  -1.931983 -0.557755 -1.803792
C  -0.196061 -1.742822 0.81758
C  -4.310879 0.17105 -0.506261
C  2.601761 -1.386909 0.945035
C  3.552657 0.949733 -0.803792
C  -3.168366 -0.981891 -2.330324
C  -4.368398 -0.615762 -1.674608
C  0.643126 -2.767522 1.287566
C  2.041642 -2.616237 1.347822
C  3.205747 0.497344 -2.206983
C  3.793088 -0.544652 -2.844788
H  0.05112 1.114517 -0.960391
H  -1.493824 0.49663 2.470649
H  -1.59733 2.268395 2.703471
H  -3.264068 2.532783 0.970702
H  -3.816117 1.175738 1.984713
H  0.973076 1.32909 2.355677
H  0.608239 3.062429 2.031198
H  -0.999205 -0.845136 -2.304993
H  -1.275732 -1.90158 0.743496
H  -5.238976 0.457596 0.00414
H  3.68513 -1.247438 1.012517
H  4.362952 0.326581 -0.38484
H  3.891307 2.002306 -0.811352
H  -3.198904 -1.590978 -3.240237
H  -5.336058 -0.94229 -2.071522
H  2.67643 -3.4291 1.711021
H  2.435391 1.093469 -2.718123
H  3.525399 -0.814933 -3.871996
H  4.565113 -1.155255 -2.359167
