program: Gaussian 09
title: 000202337
version: EM64L-G09RevD.01
frameworkgroup: C1[X(C23H25NO)]
method: RPBEPBE
basis: SDD
operation: Freq
keyword: #p
keyword: freq=noraman
keyword: PBEPBE/SDD
title: #p freq=noraman PBEPBE/SDD
converged: YES YES NO NO
title: Mulliken charges:
elementType: O N C C C C C C C C C C C C C C C C C C C C C C C H H H H H H H H H H H H H H H H H H H H H H H H H
charge: -0.266954 -0.060663 -0.134141 -0.152152 -0.485447 -0.485802 -0.506679 -0.465938 0.052177 -0.647980 -0.402833 0.405104 0.350398 0.375474 0.410592 -0.460213 -0.436103 -0.384225 -0.391096 -0.416333 -0.432519 -0.242545 -0.246967 -0.251449 -0.250571 0.230522 0.225384 0.216535 0.228751 0.229259 0.217444 0.209690 0.233875 0.230692 0.191265 0.216345 0.193387 0.227558 0.226029 0.183292 0.232691 0.229003 0.206264 0.208634 0.235455 0.239065 0.228315 0.229316 0.229103 0.228988
chargesum: 0.00000
title: Mulliken charges with hydrogens summed into heavy atoms:
elementType: O N C C C C C C C C C C C C C C C C C C C C C C C
charge: -0.266954 -0.060663 0.096381 0.073232 -0.040162 -0.039099 -0.063115 -0.043981 0.268522 -0.001006 -0.219540 0.405104 0.350398 0.375474 0.410592 -0.227522 -0.207100 -0.177961 -0.182461 -0.180878 -0.193454 -0.014230 -0.017650 -0.022346 -0.021583
polarizability: 2.63190941e+02 -5.56518512e+01 2.82525377e+02 1.67378940e+01 8.47810400e+00 2.28005100e+02
1716.lowfreq: -3.1413 -0.0006 -0.0002 0.0007 8.0333 8.4482 26.7178 35.3279 41.2203
frequency: 26.2272 35.1540 41.1829 55.3790 90.1786 102.1348 112.1689 156.3945 185.8019 191.0019 210.2688 217.2358 233.3299 267.3367 280.3205 287.9020 324.5897 329.2178 350.0537 366.4590 388.9789 390.1805 430.2735 452.9724 472.5652 477.7568 497.5629 526.6368 533.2044 565.8805 588.5891 602.2946 625.9002 657.6323 692.9299 707.4559 715.7798 727.1671 739.3284 752.1255 760.9573 772.2583 773.7678 783.8412 810.5968 818.6701 824.0968 837.2229 855.4833 864.2310 878.8082 884.3782 901.7508 911.1310 922.6876 951.5580 955.3487 959.9689 974.4367 977.7491 980.4611 987.2730 990.8012 994.2814 1037.3725 1040.9748 1043.2365 1047.0213 1068.4770 1106.2283 1107.5880 1110.5178 1115.5986 1127.3059 1146.3382 1154.9824 1163.4580 1173.9736 1175.3494 1187.6069 1193.7783 1203.5614 1221.9316 1225.0908 1232.6332 1241.4947 1245.8642 1246.5297 1251.3174 1270.9959 1283.0977 1286.6207 1294.8390 1310.0142 1315.6569 1320.2200 1347.2729 1354.9210 1357.5036 1372.3665 1387.0770 1390.7905 1421.7116 1426.0606 1428.0536 1445.7195 1456.2956 1458.8060 1465.1086 1465.5366 1481.4970 1482.4374 1487.0304 1495.2569 1566.9895 1578.6547 1604.9576 1609.8965 1636.7278 2879.4000 2951.8802 2963.1435 2982.4457 2999.5578 3004.6601 3012.3941 3021.0651 3033.8846 3045.1913 3052.0779 3056.6282 3072.7510 3076.2709 3078.2198 3081.7254 3109.0623 3111.5156 3117.7020 3119.6634 3123.0073 3138.7456 3140.3627 3160.5521 3161.6674
redmass: 4.3145 3.6696 4.4844 4.8316 3.9294 4.1408 4.6789 3.8971 2.6654 2.2761 1.1163 3.9435 3.6574 4.3437 3.3785 2.3683 4.9491 4.8436 2.4728 2.6364 3.5250 3.3788 3.7952 3.0758 3.5414 3.3037 3.4385 5.1727 4.4035 3.3646 3.1662 3.2842 5.7973 6.0020 4.4992 5.0581 3.6973 1.7386 4.3983 2.2192 2.4254 1.9717 1.9734 1.9749 1.6011 2.5843 2.9278 2.2809 3.4693 1.5884 2.0310 1.8414 2.7247 4.2882 3.7918 1.4331 1.4410 2.0911 2.7428 1.8149 1.3332 1.3429 1.3406 3.6682 2.0475 2.6225 1.7027 2.2389 2.0487 1.6311 2.3725 1.3549 1.7992 1.9951 1.3122 2.0027 2.1232 1.1483 1.0745 2.0919 1.4943 1.5631 1.6823 1.4225 2.3669 1.5979 1.3800 1.3930 1.3846 1.3854 1.3965 1.5066 1.6148 1.3364 1.3121 1.2719 1.4580 1.5280 1.6390 1.4112 4.7476 2.8601 1.8025 2.1153 1.1682 1.0893 2.1954 1.0995 1.0585 1.0719 2.4792 1.0525 1.0883 2.8249 6.9028 6.5574 6.0710 6.1572 7.1419 1.0536 1.0833 1.0827 1.0621 1.0593 1.0612 1.0632 1.0752 1.0866 1.0883 1.1031 1.1011 1.1029 1.1005 1.1041 1.0835 1.0942 1.0873 1.0860 1.0881 1.0890 1.0927 1.0934 1.1005 1.1006
irintensity: 0.4037 0.1216 0.0774 0.4091 0.2312 0.2935 0.6767 0.3288 0.4007 0.1826 0.0361 2.2246 2.6160 7.3506 1.4534 1.4829 1.9082 1.9083 1.3171 4.0126 2.2316 0.4145 1.2670 10.5772 6.4562 3.3834 0.6300 0.4568 0.3988 0.6647 0.5375 10.4205 11.9654 10.2067 5.1124 0.8760 10.6362 24.9656 0.6914 7.4454 36.1320 16.2990 9.9356 47.4695 71.7809 2.2699 16.0588 4.4845 4.6243 0.3436 1.4042 2.7190 9.3154 2.7572 34.9105 0.9066 3.5243 2.7155 27.2026 0.3791 1.0719 0.1515 0.8608 140.0244 50.7759 2.1938 18.7541 7.5959 21.8275 4.7435 4.9308 1.1499 0.9959 22.3686 3.5925 1.5058 5.7727 0.2859 0.0108 4.1527 0.6834 9.7479 4.0469 4.9450 3.2907 1.9068 1.9749 0.7905 0.7445 0.3931 2.4453 20.2210 16.8675 4.7114 1.0638 22.8320 9.2459 5.5164 6.3853 7.0106 3.1486 2.5539 1.4207 6.9233 4.6825 5.6854 4.0051 4.6758 11.7428 12.1596 4.0655 1.9997 25.0196 15.3111 1.4355 0.2068 2.2453 1.5273 1.9886 116.6434 26.9517 22.4394 38.7719 16.6175 17.5365 38.4582 54.1971 78.0775 18.3818 6.9409 14.0441 29.5205 34.3788 81.5570 0.3522 25.4106 11.7768 12.0721 7.0677 1.6155 22.1158 33.4124 45.4398 31.5230
temp: 298.150 k
press: 1.00000 atm
elementType: 8 7 6 6 6 6 6 6 6 6 6 6 6 6 6 6 6 6 6 6 6 6 6 6 6 1 1 1 1 1 1 1 1 1 1 1 1 1 1 1 1 1 1 1 1 1 1 1 1 1
symmnumber: 1
zpe: 1106206.2 jmol-1
zpe.correction: 0.421332 hartree
zpe.thermalcorrener: 0.441835 hartree
zpe.thermalcorrenthalpy: 0.442779 hartree
zpe.thermalcorrgfe: 0.372052 hartree
zpe.sumelectzpe: -1019.591747 hartree
zpe.sumelectthermal: -1019.571244 hartree
zpe.sumelectthermalent: -1019.570299 hartree
zpe.sumelectthermalfe: -1019.641026 hartree
dipole: -1.0294 1.7712 -0.4953
dipole: 2.1076
quadrupole: -137.6446 -145.0095 -135.6433
quadrupole: -6.5925 3.8399 3.2989
quadrupole: 1.7879 -5.5771 3.7891 -6.5925 3.8399 3.2989
hfenergy: -1020.0130785 hartree
pointgroup: C01 [X(C23H25N1O1)]
dipole: 0.3050064 -0.7038827 -0.3147817 debye
polarizability: 248.4112481|-47.1154656|297.6933782|-25.8524418|5.4489582|227.6167916 unknown
InChI: InChI=1S/C23H25NO/c1-24-18-12-13-19(24)15-20(14-18)25-23-21-8-4-2-6-16(21)10-11-17-7-3-5-9-22(17)23/h2-11,18-20,23H,12-15H2,1H3
charge 0 multiplicity 1
50 atoms
O  0.164109 0.875125 0.339749
N  4.314476 1.049063 0.168032
C  3.771422 0.189443 1.271836
C  3.734347 0.374741 -1.038475
C  3.973267 -1.291146 0.772164
C  3.953566 -1.165643 -0.789747
C  2.274159 0.544144 1.444772
C  2.229527 0.744842 -1.102968
C  1.486001 0.232776 0.156974
C  5.793215 1.136424 0.151314
C  -0.860028 0.531726 -0.685902
C  -2.08114 1.358379 -0.328621
C  -1.098142 -0.971269 -0.78148
C  -2.790637 1.169047 0.900261
C  -1.552845 -1.746425 0.335297
C  -2.461159 2.411431 -1.193952
C  -0.758659 -1.631828 -1.987927
C  -2.557088 0.067173 1.839196
C  -2.027557 -1.177516 1.600595
C  -3.82412 2.096379 1.232675
C  -1.580257 -3.168134 0.204872
C  -3.5109 3.29561 -0.867201
C  -0.828965 -3.035663 -2.112146
C  -4.188642 3.142163 0.365647
C  -1.228976 -3.810071 -0.996918
H  4.314804 0.395985 2.21061
H  4.24541 0.730854 -1.950574
H  3.178661 -1.95891 1.150114
H  4.938626 -1.694762 1.126273
H  4.912242 -1.496886 -1.227452
H  3.154226 -1.773376 -1.250602
H  1.83206 -0.011721 2.292444
H  2.188482 1.624226 1.659559
H  2.140817 1.846047 -1.147322
H  1.782633 0.317562 -2.022294
H  1.337855 -0.864283 0.071431
H  6.323045 0.156147 0.070087
H  6.134884 1.630191 1.078649
H  6.108722 1.765155 -0.700587
H  -0.494803 0.873973 -1.677685
H  -1.904386 2.553722 -2.128099
H  -0.418449 -1.03016 -2.840545
H  -2.950672 0.240283 2.851109
H  -2.049936 -1.88487 2.442085
H  -4.358916 1.967931 2.181744
H  -1.912829 -3.766685 1.061897
H  -3.781246 4.107291 -1.55124
H  -0.557898 -3.521051 -3.056041
H  -4.992679 3.83236 0.643805
H  -1.270725 -4.902491 -1.069021
