program: Gaussian 09
title: 000202263
version: EM64L-G09RevD.01
frameworkgroup: C1[X(C6H7N3O2)]
method: RPBEPBE
basis: SDD
operation: Freq
keyword: #pfreq=noraman
keyword: PBEPBE/SDD
title: #p freq=noraman PBEPBE/SDD
converged: YES YES NO NO
title: Mulliken charges:
elementType: O O N N N C C C C C C H H H H H H H
charge: -0.164036 -0.231435 -0.158893 -0.031698 0.071137 -0.427439 0.195701 -0.119049 -0.303259 -0.067675 -0.552356 0.272065 0.259047 0.286182 0.266381 0.246213 0.229495 0.229619
chargesum: 0.00000
title: Mulliken charges with hydrogens summed into heavy atoms:
elementType: O O N N N C C C C C C
charge: -0.164036 -0.231435 -0.158893 -0.031698 0.071137 0.103673 0.195701 0.167133 -0.036878 0.178537 -0.093242
polarizability: 1.34438007e+02 4.04603631e+00 1.04354312e+02 -8.74305903e+00 3.44355521e+00 5.01666382e+01
1716.lowfreq: -11.3331 -4.8033 0.0006 0.0006 0.0007 5.1011 33.4694 59.5362 85.7583
frequency: 33.4514 59.5293 85.7486 156.0291 191.3581 220.1310 270.5214 340.8137 387.4383 432.8759 539.1058 587.9147 617.7724 631.4877 700.8088 731.0899 772.9304 783.7207 866.0164 886.5335 916.3365 956.8974 973.3444 1015.0347 1053.3426 1100.8192 1142.9565 1146.8860 1208.9633 1221.2681 1254.9999 1289.5912 1306.0792 1339.6801 1352.6751 1364.1784 1415.0566 1435.6086 1449.7925 1475.7215 1661.9093 3023.4139 3080.8938 3093.7236 3109.1331 3205.8791 3232.7168 3257.1090
redmass: 5.2459 3.7567 3.3484 3.7561 4.2742 4.8152 4.4100 4.8112 2.7492 5.4871 3.5111 2.1439 4.3751 5.4763 11.8593 4.3726 3.8950 1.3087 1.4159 5.9019 1.4221 2.0971 1.3505 1.1930 1.8932 2.3275 2.6457 2.3701 2.0025 3.4796 1.6420 1.2564 3.2063 2.6836 4.7626 6.1122 2.1764 1.3286 2.6189 1.4143 4.6573 1.0604 1.1004 1.0623 1.0948 1.1147 1.0923 1.1077
irintensity: 0.8763 2.8181 1.0409 0.3540 2.1913 0.5313 2.1443 2.7189 0.2192 0.5016 6.2508 11.3737 9.0021 5.1177 0.1883 17.4131 23.6821 61.3663 3.0853 5.1420 7.6221 13.9818 71.6767 23.6731 16.8408 32.6393 63.5583 31.8206 11.1697 65.3785 43.6545 1.4287 96.2489 82.8922 20.6287 205.3783 8.6726 14.0215 18.3247 8.5564 4.5481 6.1973 2.0270 9.1650 6.7376 16.8719 2.9181 0.4011
temp: 298.150 k
press: 1.00000 atm
elementType: 8 8 7 7 7 6 6 6 6 6 6 1 1 1 1 1 1 1
symmnumber: 1
zpe: 343204.4 jmol-1
zpe.correction: 0.130720 hartree
zpe.thermalcorrener: 0.140714 hartree
zpe.thermalcorrenthalpy: 0.141658 hartree
zpe.thermalcorrgfe: 0.093798 hartree
zpe.sumelectzpe: -546.596667 hartree
zpe.sumelectthermal: -546.586673 hartree
zpe.sumelectthermalent: -546.585729 hartree
zpe.sumelectthermalfe: -546.633589 hartree
dipole: 7.0188 1.8275 -0.0224
dipole: 7.2529
quadrupole: -70.4638 -65.5066 -61.9162
quadrupole: -1.0955 0.2773 0.3122
quadrupole: -4.5016 0.4556 4.0460 -1.0955 0.2773 0.3122
hfenergy: -546.7273868 hartree
pointgroup: C01 [X(C6H7N3O2)]
dipole: 2.5929731 1.0447943 0.5721819 debye
dipolederiv: -0.9374608 -0.2238781 -0.0402288 -0.1861419 -0.4242453 -0.0809158 -0.0071056 -0.084603 -0.2274304 -0.6227094 0.1886082 0.0958611 0.0869303 -0.7475691 -0.2054816 0.0309096 -0.1965192 -0.3208109 -0.3384238 0.4340297 0.0948522 0.5832232 -0.137527 0.0083023 0.0165377 -0.0275485 -0.0779091 -0.4359315 0.086111 0.00272 0.4050874 0.0610672 0.1026187 0.1391431 0.1080966 -0.1652856 1.4446129 0.3030115 0.0159754 0.3820189 1.4610724 0.4900203 0.0325552 0.4691256 0.3718156 0.5138941 -0.1377929 -0.0386817 -0.3664342 0.2542207 -0.0291481 0.0668723 0.0140098 0.2174534 0.3002493 -0.382589 -0.0736192 -0.4597736 -0.5744328 -0.2476389 -0.1391296 -0.2357541 0.0185916 0.1562826 0.151391 0.06148 -0.491355 -0.2257677 -0.0726001 -0.1011854 -0.0273801 -0.1158865 -0.2830322 -0.4685835 -0.1430332 -0.091204 0.1207602 0.0754123 -0.0552972 0.048499 -0.1412839 0.0820091 0.0754876 0.0091664 0.1675527 -0.1954078 0.000286 0.0504044 0.0069161 0.1277204 -0.1455044 0.0822923 0.026753 0.0757659 -0.3224862 0.0666842 0.0051632 0.0575624 0.0955656 0.0208962 -0.068397 0.0195165 0.0457991 0.0323743 0.0324237 0.0193823 0.0260459 0.0898745 -0.0194537 0.0368908 0.0334536 0.0411164 0.0716143 0.0176186 0.0110506 -0.0205564 -0.0683897 0.0364704 -0.0327991 -0.0228049 -0.0426976 0.1332792 -0.0146303 -0.0009457 -0.0186917 0.1870052 0.1011203 0.0339601 0.0027443 0.0104322 0.0033 -0.0522931 -0.0091902 -0.0563226 0.1666759 0.0557742 -0.013415 0.0392305 -0.0746634 0.1383907 -0.0252805 -0.0001511 -0.0143159 -0.0924842 -0.0362921 -0.0381945 -0.0742831 -0.0596791 0.1779328 -0.0294097 -0.0841917 -0.0300014 0.0278629 0.1074987 -0.0261334 -0.0091021 -0.0259771 0.1734242 -0.0359683 0.0251779 -0.0185625 -0.0930848 unknown
polarizability: 133.2402311|8.722863|99.4481419|0.9034403|19.0571629|56.2705833 unknown
InChI: InChI=1S/C6H7N3O2/c1-2-4-8-5-3-7-6(8)9(10)11/h2-3,5H,1,4H2
charge 0 multiplicity 1
18 atoms
O  -2.98431 -1.25168 -0.662577
O  -0.884829 -2.040516 -1.124959
N  0.249745 0.340532 -0.090429
N  -1.85687 1.234869 0.019101
N  -1.708428 -1.118707 -0.700811
C  1.393444 -0.604221 -0.28873
C  -1.129271 0.131129 -0.255896
C  0.377813 1.666486 0.309921
C  -0.923452 2.197925 0.371144
C  2.606106 -0.200303 0.518208
C  3.833092 0.006066 -0.019991
H  1.04162 -1.60761 0.003088
H  1.628546 -0.652842 -1.366351
H  1.350583 2.107734 0.509086
H  -1.227415 3.205756 0.642291
H  2.46438 -0.135908 1.606912
H  4.701494 0.232946 0.607638
H  4.007153 -0.057958 -1.101243
