program: Gaussian 09
title: 000202380
version: EM64L-G09RevD.01
frameworkgroup: C1[X(C19H30N2O2)]
method: RPBEPBE
basis: SDD
operation: Freq
keyword: #p
keyword: freq=noraman
keyword: PBEPBE/SDD
title: #p freq=noraman PBEPBE/SDD
converged: YES YES NO NO
title: Mulliken charges:
elementType: O O N N C C C C C C C C C C C C C C C C C C C H H H H H H H H H H H H H H H H H H H H H H H H H H H H H H
charge: -0.350153 -0.300249 -0.066805 -0.386703 -0.439808 -0.423692 -0.445673 -0.441728 -0.313599 -0.406696 -0.356181 -0.423287 -0.340613 0.161900 -0.292656 -0.355541 0.044372 0.320991 -0.693254 -0.317399 -0.349089 -0.250349 -0.234051 0.237909 0.210564 0.232141 0.201074 0.223638 0.214699 0.219563 0.220222 0.251630 0.176832 0.257428 0.206602 0.364976 0.191402 0.206648 0.215462 0.199591 0.184322 0.187583 0.210191 0.222661 0.198288 0.196189 0.209830 0.209193 0.219199 0.284039 0.248493 0.232393 0.227501
chargesum: 0.00000
title: Mulliken charges with hydrogens summed into heavy atoms:
elementType: O O N N C C C C C C C C C C C C C C C C C C C
charge: -0.350153 -0.300249 -0.066805 -0.021726 0.008665 0.009524 -0.007335 -0.001942 0.114862 0.057333 0.041870 -0.008235 0.031292 0.161900 0.140196 0.038936 0.044372 0.320991 -0.055031 -0.033360 -0.100596 -0.017957 -0.006550
polarizability: 2.75058079e+02 2.55511708e+01 2.44224812e+02 -1.37424037e+01 1.97806457e+01 1.66698008e+02
1716.lowfreq: -11.6617 -6.1437 -0.0006 -0.0003 0.0003 2.6980 7.8765 13.7403 24.0495
frequency: -4.1272 13.1138 23.9880 35.3534 42.1874 53.7277 58.4067 63.9622 80.6535 82.0368 90.6363 118.2557 124.0050 128.8812 144.9228 149.7563 191.9132 217.8810 228.1407 244.7645 253.7307 294.0780 298.6373 336.8939 361.0491 380.2274 392.4574 417.3562 436.3967 466.4999 492.6973 526.3918 531.9090 606.1956 609.6570 646.3734 660.6438 676.0465 704.1622 723.8051 737.1758 755.0449 756.7632 765.5755 771.2924 785.8646 826.1427 833.2419 846.4009 859.3518 862.1373 876.6612 888.1769 899.0102 905.7247 921.0061 933.6525 962.5094 977.7071 994.6669 1001.2985 1019.8827 1028.4291 1036.2747 1038.8522 1045.1808 1055.2830 1075.1620 1078.0152 1078.9035 1083.7218 1095.1587 1121.4677 1142.1702 1150.0735 1157.5659 1171.5054 1172.5157 1192.4597 1198.2036 1200.7926 1215.1067 1221.0844 1244.9491 1253.8803 1255.7990 1261.8637 1273.0252 1282.5098 1284.3768 1286.9809 1295.4273 1295.9508 1299.6261 1311.5784 1316.7879 1318.7048 1324.1095 1353.2382 1362.1655 1365.5440 1367.4291 1383.3965 1390.0369 1430.4111 1445.5037 1453.5114 1463.4407 1465.1773 1465.3587 1468.2882 1471.4169 1472.5813 1477.4341 1479.2022 1481.2213 1482.0321 1489.0974 1489.4946 1521.6711 1568.5313 1595.0178 1616.2392 2877.4347 2952.4682 2960.8262 2965.1743 2970.5551 2973.2304 2979.6434 2980.5478 2989.3335 2992.2559 3001.1800 3008.2633 3013.5623 3015.8862 3024.6534 3031.9282 3047.7370 3049.6807 3054.8306 3064.3609 3069.4983 3073.5676 3076.5382 3086.2687 3087.4273 3133.1754 3148.4258 3163.5557 3174.1623 3450.1992
redmass: 4.0312 3.7296 4.5278 4.8400 3.2885 1.9729 3.4284 2.6907 2.0690 2.3964 3.9448 3.0950 2.7783 2.1847 4.1155 3.0305 4.3375 2.6346 1.1402 2.5503 4.1698 3.3894 3.4449 3.4638 4.3180 2.7614 3.6002 2.4799 3.7210 3.9687 3.0839 4.0530 4.6900 2.6293 3.5505 4.7701 3.5528 4.0933 1.1343 1.1251 1.4296 1.4746 2.4921 1.5471 1.7967 1.9857 2.1750 1.8350 1.9327 2.0627 1.4590 3.6266 2.1609 1.6708 2.5492 2.1407 1.5745 1.3477 1.5462 4.3730 1.3303 2.8521 3.4889 2.0442 2.8166 2.3816 2.3585 2.3046 1.7750 2.3200 2.0471 2.8223 2.3717 1.7393 2.2574 1.9321 1.2688 1.1755 1.2616 1.5142 2.9073 1.2632 1.2754 1.3685 1.3228 1.4743 1.4425 1.2428 1.6911 1.3674 1.0485 1.1357 1.3068 1.1569 1.1984 1.3237 1.4007 1.3829 1.5629 1.5368 1.5697 1.3508 4.9423 1.2171 2.2187 1.1489 1.0822 1.0825 1.7573 1.0970 1.0857 1.0718 1.0802 1.0425 1.0912 1.1003 1.2449 1.0950 1.0925 1.8279 5.9646 6.7550 5.9003 1.0700 1.0588 1.0554 1.0605 1.0597 1.0368 1.0619 1.0670 1.0629 1.0966 1.0590 1.0614 1.0993 1.0642 1.1044 1.1052 1.1011 1.1036 1.0897 1.1027 1.1007 1.0992 1.1001 1.1038 1.1044 1.0860 1.0900 1.0945 1.0982 1.0804
irintensity: 0.4141 0.8712 1.1668 1.0410 0.1792 0.3940 2.6796 0.3654 0.5526 0.0165 2.5466 1.5709 1.2926 0.2693 0.0680 0.8940 2.3572 2.5316 0.0473 1.0133 0.8381 1.9751 7.0698 6.0523 0.8836 9.0544 2.3967 3.0847 7.0687 8.2235 0.6724 6.6710 7.2663 1.8266 8.2247 6.1668 3.9466 29.9787 69.9746 11.2747 3.8752 6.9138 73.1238 4.6357 31.0788 2.4872 6.9767 1.1438 9.5541 4.9594 0.1509 13.2243 5.3728 1.7322 1.3775 40.7293 11.2574 2.0931 26.7717 7.5734 1.2651 5.6613 2.2990 31.1858 3.3673 18.1801 8.7742 70.0113 3.4379 0.5869 6.3616 61.3042 5.3053 4.2585 4.1143 6.7657 8.8007 19.9547 16.1463 10.4411 124.5755 4.3275 4.8997 22.5342 4.9277 4.9615 10.9130 2.6181 100.3625 9.9110 0.2172 1.7978 5.2102 5.7189 0.8815 1.3094 2.9182 6.1099 0.6485 3.6346 0.6745 4.3501 10.2554 13.4818 15.9201 32.8188 9.5713 3.4224 84.8326 8.0715 12.5626 2.1417 10.6590 11.8730 3.8502 1.4381 16.2061 5.1069 22.4852 266.2489 38.6564 84.8322 129.3999 65.6523 9.4424 31.8724 2.7583 67.8993 30.7648 59.3831 57.4069 39.0806 3.0744 41.7540 48.6522 2.2344 53.1896 26.6855 26.1024 25.9116 96.6902 5.4477 2.5087 99.5500 47.3415 21.3196 31.3109 99.5417 4.6966 6.0390 21.4640 22.4046 167.5943
temp: 298.150 k
press: 1.00000 atm
elementType: 8 8 7 7 6 6 6 6 6 6 6 6 6 6 6 6 6 6 6 6 6 6 6 1 1 1 1 1 1 1 1 1 1 1 1 1 1 1 1 1 1 1 1 1 1 1 1 1 1 1 1 1 1
symmnumber: 1
zpe: 1207776.0 jmol-1
zpe.correction: 0.460018 hartree
zpe.thermalcorrener: 0.483880 hartree
zpe.thermalcorrenthalpy: 0.484824 hartree
zpe.thermalcorrgfe: 0.402988 hartree
zpe.sumelectzpe: -1000.175073 hartree
zpe.sumelectthermal: -1000.151211 hartree
zpe.sumelectthermalent: -1000.150267 hartree
zpe.sumelectthermalfe: -1000.232103 hartree
dipole: -1.7475 4.8544 3.8468
dipole: 6.4356
quadrupole: -121.0573 -142.0247 -145.9067
quadrupole: -2.7812 -2.0784 -3.8808
quadrupole: 15.2723 -5.6951 -9.5772 -2.7812 -2.0784 -3.8808
hfenergy: -1000.635091 hartree
pointgroup: C01 [X(C19H30N2O2)]
dipole: -0.2209675 2.3453131 -0.9281831 debye
polarizability: 288.1680556|-3.9189958|237.8137012|-12.0525962|-4.4583548|159.9991417 unknown
InChI: InChI=1S/C19H30N2O2/c1-2-3-4-9-16-23-18-11-6-5-10-17(18)19(22)20-12-15-21-13-7-8-14-21/h5-6,10-11,20H,2-4,7-9,12-16H2,1H3
charge 0 multiplicity 1
53 atoms
O  1.508062 1.401285 -0.372989
O  1.300207 -2.735051 0.643323
N  -3.101244 -2.756453 -0.089934
N  0.108454 -0.76138 0.368836
C  -3.489713 -3.981184 -0.843954
C  -4.248606 -1.828068 -0.315034
C  -4.142032 -3.475985 -2.170635
C  -4.817408 -2.129375 -1.755881
C  -1.781897 -2.188329 -0.468117
C  -1.174955 -1.389361 0.713834
C  -0.376788 3.429649 0.841573
C  0.19045 3.427516 -0.595457
C  -1.792184 4.044058 0.926721
C  1.279131 -1.490824 0.355879
C  1.598991 2.838491 -0.708695
C  -2.364678 4.04931 2.362311
C  2.557766 -0.759722 -0.006903
C  2.684447 0.621125 -0.355605
C  -3.77731 4.66714 2.444753
C  3.736761 -1.546718 0.00952
C  3.950564 1.172071 -0.672851
C  5.000235 -1.008207 -0.302658
C  5.103161 0.358106 -0.645149
H  -2.617902 -4.639101 -0.994321
H  -4.238952 -4.539253 -0.2479
H  -5.027881 -2.026326 0.445016
H  -3.924149 -0.779165 -0.196284
H  -3.360057 -3.301188 -2.932037
H  -4.862786 -4.200908 -2.588362
H  -5.917856 -2.221584 -1.726109
H  -4.574156 -1.322088 -2.468828
H  -1.089398 -3.017226 -0.696428
H  -1.828345 -1.530171 -1.370215
H  -1.026712 -2.089228 1.553673
H  -1.875392 -0.598306 1.040537
H  0.165521 0.228877 0.10579
H  0.30969 3.996237 1.504727
H  -0.399435 2.393827 1.234036
H  -0.487494 2.871624 -1.272982
H  0.233389 4.468381 -0.976834
H  -1.768421 5.08453 0.539539
H  -2.479966 3.481103 0.261117
H  2.293924 3.332678 0.00066
H  1.996527 2.941187 -1.738362
H  -2.390218 3.009768 2.7481
H  -1.675591 4.609312 3.026897
H  -4.492582 4.108554 1.811872
H  -3.772185 5.717642 2.097549
H  -4.163508 4.655995 3.480351
H  3.609697 -2.600261 0.280795
H  4.048142 2.226961 -0.942245
H  5.891426 -1.643289 -0.279473
H  6.076358 0.79682 -0.892267
