program: Gaussian 09
title: 000202341
version: EM64L-G09RevD.01
frameworkgroup: C1[X(C24H29NO)]
method: RPBEPBE
basis: SDD
operation: Freq
keyword: #p
keyword: freq=noraman
keyword: PBEPBE/SDD
title: #p freq=noraman PBEPBE/SDD
converged: YES YES NO NO
title: Mulliken charges:
elementType: O N C C C C C C C C C C C C C C C C C C C C C C C C H H H H H H H H H H H H H H H H H H H H H H H H H H H H H
charge: -0.289903 -0.060576 -0.150584 -0.134081 -0.484608 -0.485144 -0.469649 -0.506356 0.052083 -0.647863 -0.380141 0.370580 0.355643 0.393279 0.270502 -0.617540 -0.550418 -0.595893 -0.423951 -0.444397 -0.363153 0.461964 -0.438908 -0.257846 -0.254326 -0.817454 0.226155 0.230676 0.215425 0.230061 0.229339 0.217262 0.188977 0.232025 0.235396 0.203726 0.218974 0.193452 0.226500 0.227760 0.186204 0.260537 0.203652 0.234240 0.221563 0.231467 0.227115 0.234933 0.230179 0.228547 0.226863 0.226213 0.232815 0.223247 0.225440
chargesum: 0.00000
title: Mulliken charges with hydrogens summed into heavy atoms:
elementType: O N C C C C C C C C C C C C C C C C C C C C C C C C
charge: -0.289903 -0.060576 0.075570 0.096595 -0.039121 -0.038544 -0.048648 -0.067234 0.271057 -0.000151 -0.193937 0.370580 0.355643 0.393279 0.270502 -0.153352 -0.094615 -0.364426 -0.196836 -0.209464 -0.132973 0.461964 -0.210361 -0.030983 -0.028113 -0.135952
polarizability: 2.66917721e+02 2.46169498e+01 2.74983225e+02 -1.76281100e+01 1.10726119e+01 2.36127953e+02
1716.lowfreq: -5.0267 -0.4446 -0.0006 -0.0004 0.0001 5.5600 21.3480 26.3807 32.2695
frequency: 20.5007 26.3088 31.8720 40.9598 50.5106 75.3595 87.1988 104.7981 147.2132 161.4916 174.5798 190.9471 208.9417 212.1254 218.4884 251.3033 276.5311 284.2198 291.8266 309.2532 335.7434 354.6723 364.5925 380.2599 396.7557 427.1723 438.3695 449.5265 461.7576 466.6893 495.9351 501.2951 544.0090 562.3308 584.2732 610.8592 635.3670 663.6536 691.7606 698.7950 725.1105 736.8554 738.8090 755.2155 768.5012 773.3921 779.9271 785.5669 819.9851 832.0959 836.9651 862.7803 864.4613 867.8765 875.5173 901.3600 907.3780 921.0023 941.6546 957.6197 959.4957 961.8406 971.6494 976.0378 980.1113 985.8816 988.1098 1002.0462 1035.5534 1038.0887 1042.7569 1048.2895 1057.0423 1069.2563 1103.3719 1106.5977 1112.2637 1125.7128 1127.0926 1145.2246 1153.7999 1156.0103 1175.1977 1178.0690 1193.4386 1196.9809 1202.6630 1204.0035 1220.9271 1225.6171 1228.3134 1242.1810 1249.0596 1255.2981 1261.4442 1270.5372 1280.4763 1286.8326 1293.0188 1305.5960 1314.7089 1316.9470 1332.4324 1344.3499 1347.3599 1353.4967 1359.0784 1364.4252 1379.8098 1388.3643 1397.9720 1416.0972 1425.6567 1435.3907 1446.1601 1446.7107 1458.4812 1460.5558 1463.2115 1465.2545 1471.0279 1476.7547 1482.0456 1487.0280 1489.0082 1504.2806 1586.7285 1589.4276 1611.2287 1621.9092 2878.4892 2956.2593 2957.5113 2963.6067 2974.2592 2985.7449 2994.1575 3000.2272 3000.4483 3012.8773 3014.6110 3021.2833 3034.6070 3045.7293 3051.9049 3053.0031 3058.2070 3058.9664 3070.2913 3076.5850 3078.4023 3081.8757 3095.0987 3108.7354 3111.4012 3117.6403 3136.4190 3136.5536 3159.2876
redmass: 3.9677 3.7359 3.7200 1.0860 4.3008 3.2498 3.8277 4.2214 3.5346 3.5438 2.7680 2.2791 1.0696 2.9623 3.2213 3.5401 4.0253 2.0990 4.5349 3.0856 3.4351 2.6490 2.5733 3.3529 3.4495 3.4984 2.7051 3.5235 2.8396 3.4768 3.6727 4.2577 3.2400 3.2964 2.7555 3.5518 5.7091 5.6740 4.4251 4.0769 2.7245 3.8212 4.3858 1.8791 2.8254 2.9162 3.1913 2.1963 2.5459 1.3177 2.2134 2.3460 1.6567 1.5652 3.5381 1.7497 2.3392 2.8941 1.7479 1.6763 1.7345 2.1011 3.0790 2.2905 1.8258 1.3529 3.1252 1.5994 2.6706 1.9884 1.7118 1.5596 2.3930 2.0453 1.6012 2.1084 1.3408 2.0313 2.0696 1.3368 1.9295 1.6892 1.1561 1.2051 1.5391 1.7235 1.6125 1.8547 1.7393 1.4219 1.3357 1.6143 1.2908 1.4361 3.3198 1.3770 1.3416 1.4556 1.5568 1.3104 1.3233 1.2791 1.5617 1.5900 1.6814 1.4186 1.4524 1.4634 4.6955 2.8936 1.2827 2.8105 1.1701 2.2986 1.0938 1.1129 1.0929 1.0974 1.0596 1.0688 1.0470 1.1073 1.0506 1.0907 2.3588 2.9498 6.6013 6.2357 6.1174 6.6443 1.0537 1.0831 1.0622 1.0828 1.0373 1.0618 1.0651 1.0603 1.0601 1.0632 1.0923 1.0751 1.0867 1.0884 1.0974 1.1032 1.1012 1.1017 1.1021 1.1005 1.1045 1.0986 1.0907 1.0870 1.0870 1.0881 1.0929 1.0963 1.1007
irintensity: 0.3300 0.0666 0.1108 0.4330 0.3727 0.3532 0.1282 0.4254 1.6682 0.7181 0.0929 0.2648 0.1885 3.6071 0.9487 4.0184 1.8496 0.5865 8.9230 0.8100 0.5552 0.9957 4.6835 1.7798 0.9531 1.7996 6.4730 2.0576 3.1281 1.5325 0.2945 0.2236 3.6089 2.4921 11.2807 10.2826 12.2036 7.0359 4.1053 2.2183 4.8883 2.4547 1.0058 65.1000 16.8734 0.3433 6.0955 16.8707 0.5323 42.4512 9.4058 10.3339 4.7847 3.7755 5.3485 9.7495 5.6189 26.8135 1.1892 1.2101 2.4819 4.3910 54.1281 4.3454 0.4652 0.7383 104.6597 3.4406 6.1512 39.9103 23.6449 12.5808 2.2215 22.1011 5.5539 6.5873 0.5110 4.6648 21.1645 2.8820 1.8738 6.9772 1.7037 4.7238 0.8267 0.9088 1.2914 17.9225 3.1974 5.4878 1.4125 1.1165 2.2303 2.7086 5.8697 0.4706 1.8459 14.7693 14.5388 2.9814 4.0378 17.5217 5.0966 10.3677 13.6964 6.5893 1.9285 4.1912 0.1101 3.4625 9.2061 4.5809 3.4924 4.5398 9.1611 9.8270 6.9509 10.5714 11.8772 12.6357 11.7978 11.8813 1.8302 22.9221 16.1199 29.6545 1.0555 0.9417 2.1762 3.0238 118.5277 30.3834 28.4173 19.1335 42.0550 40.9938 24.3360 8.2276 30.4190 38.9849 45.7536 54.5393 77.8973 18.1137 21.6481 6.0672 14.5261 8.8831 25.5681 33.8551 90.0921 17.8050 18.7807 13.5264 12.3296 4.3088 25.1087 35.7869 38.0350
temp: 298.150 k
press: 1.00000 atm
elementType: 8 7 6 6 6 6 6 6 6 6 6 6 6 6 6 6 6 6 6 6 6 6 6 6 6 6 1 1 1 1 1 1 1 1 1 1 1 1 1 1 1 1 1 1 1 1 1 1 1 1 1 1 1 1 1
symmnumber: 1
zpe: 1236737.1 jmol-1
zpe.correction: 0.471048 hartree
zpe.thermalcorrener: 0.494050 hartree
zpe.thermalcorrenthalpy: 0.494994 hartree
zpe.thermalcorrgfe: 0.417654 hartree
zpe.sumelectzpe: -1060.002254 hartree
zpe.sumelectthermal: -1059.979252 hartree
zpe.sumelectthermalent: -1059.978308 hartree
zpe.sumelectthermalfe: -1060.055648 hartree
dipole: 1.1272 2.1184 -0.3972
dipole: 2.4322
quadrupole: -144.3738 -153.9987 -145.0837
quadrupole: 3.3489 -4.5265 1.6891
quadrupole: 3.4449 -6.1800 2.7351 3.3489 -4.5265 1.6891
hfenergy: -1060.4733021 hartree
pointgroup: C01 [X(C24H29N1O1)]
dipole: -0.3387122 -0.8525107 -0.2723594 debye
polarizability: 261.6710078|19.8520337|282.640694|21.3769695|-2.5085667|233.7171969 unknown
InChI: InChI=1S/C24H29NO/c1-16-7-8-18-10-9-17-5-3-4-6-22(17)24(23(18)13-16)26-21-14-19-11-12-20(15-21)25(19)2/h3-8,13,19-21,24H,9-12,14-15H2,1-2H3
charge 0 multiplicity 1
55 atoms
O  -0.28632 0.972099 0.452587
N  -4.43383 1.022434 0.170883
C  -3.805471 0.317727 -0.992815
C  -3.9015 0.219075 1.320332
C  -3.993765 -1.216808 -0.691301
C  -4.052246 -1.284182 0.873113
C  -2.308461 0.722418 -1.031945
C  -2.418086 0.61793 1.519484
C  -1.585431 0.280831 0.266313
C  -5.912798 1.077168 0.111361
C  0.783366 0.561654 -0.512934
C  1.141723 -0.915065 -0.371019
C  1.922222 1.564905 -0.33562
C  1.617966 -1.439384 0.86492
C  2.918219 1.517402 0.685595
C  1.873898 -0.508249 2.03543
C  3.066936 0.441751 1.767199
C  0.958542 -1.779323 -1.473656
C  1.950417 2.634326 -1.272177
C  1.886935 -2.823864 0.949074
C  3.901258 2.545781 0.710643
C  1.239211 -3.168668 -1.398391
C  1.701374 -3.679992 -0.162295
C  2.931534 3.64358 -1.233484
C  3.922576 3.595789 -0.227167
C  1.050528 -4.069582 -2.607281
H  -4.299228 0.626474 -1.931275
H  -4.474678 0.446738 2.23615
H  -3.16727 -1.820487 -1.10734
H  -4.93189 -1.588829 -1.140415
H  -5.015967 -1.699524 1.217644
H  -3.251082 -1.915874 1.296432
H  -1.828088 0.271318 -1.92247
H  -2.243781 1.822811 -1.117155
H  -2.365024 1.706872 1.697367
H  -1.989679 0.102624 2.399832
H  -1.398798 -0.813421 0.228748
H  -6.420558 0.083593 0.053173
H  -6.217279 1.666609 -0.772032
H  -6.29008 1.598176 1.009493
H  0.384352 0.708318 -1.538151
H  0.973635 0.098708 2.240502
H  2.101913 -1.103871 2.939311
H  3.954232 -0.176643 1.515204
H  3.315725 0.957922 2.715587
H  0.590175 -1.360823 -2.420995
H  1.172534 2.670965 -2.044852
H  2.250566 -3.238903 1.897406
H  4.668289 2.513227 1.495373
H  1.918751 -4.750961 -0.067482
H  2.922365 4.453119 -1.971349
H  4.697906 4.368284 -0.172028
H  1.763915 -3.813458 -3.413848
H  1.208033 -5.13059 -2.347282
H  0.033616 -3.97293 -3.031703
