program: Gaussian 09
title: 000202291
version: EM64L-G09RevD.01
frameworkgroup: C1[X(C13H15N3O3)]
method: RPBEPBE
basis: SDD
operation: Freq
keyword: #p
keyword: freq=noraman
keyword: PBEPBE/SDD
title: #p freq=noraman PBEPBE/SDD
converged: YES YES NO NO
title: Mulliken charges:
elementType: O O O N N N C C C C C C C C C C C C C H H H H H H H H H H H H H H H
charge: -0.281495 -0.301979 -0.290004 -0.131327 -0.253528 -0.388995 0.358790 0.009252 0.068134 0.454188 -0.654188 -0.805533 -0.360127 -0.385945 -0.214942 -0.210848 -0.250182 0.248040 -0.490062 0.269511 0.253846 0.239856 0.233914 0.330578 0.234030 0.366809 0.284088 0.264562 0.229922 0.228656 0.231199 0.234278 0.239708 0.239794
chargesum: 0.00000
title: Mulliken charges with hydrogens summed into heavy atoms:
elementType: O O O N N N C C C C C C C C C C C C C
charge: -0.281495 -0.301979 -0.290004 -0.131327 -0.253528 -0.022186 0.358790 0.009252 0.068134 0.454188 0.109026 -0.007010 -0.076040 -0.121383 0.014980 0.017808 -0.018984 0.248040 0.223718
polarizability: 2.72636408e+02 -7.56790958e-01 1.79157328e+02 6.21956369e+00 1.35629716e+01 1.00015597e+02
1716.lowfreq: -7.5072 -5.2360 -0.0008 -0.0007 0.0000 0.3001 25.7132 45.6343 55.7605
frequency: 25.5245 45.6082 55.7525 70.6259 74.7104 80.5191 120.6929 131.4586 152.7052 171.6816 180.5744 210.0255 216.4003 247.5935 258.0747 275.1637 300.7585 306.1524 353.1923 376.0554 408.5128 415.3545 441.9491 500.3283 562.7799 581.8490 614.2393 618.2735 629.6545 662.1020 682.0874 694.9726 713.1146 730.1741 764.4272 767.4271 803.5408 843.8402 899.2968 914.7736 918.8642 972.1537 986.1357 991.4294 1010.8817 1031.4685 1035.6312 1051.6346 1065.5266 1085.2835 1101.4833 1119.3561 1130.0845 1149.4574 1160.0538 1172.8571 1186.2935 1193.1458 1236.5095 1277.5256 1319.8913 1342.5411 1355.5610 1385.8272 1407.3066 1426.8579 1433.2488 1445.5634 1451.3082 1462.6760 1468.4793 1475.0282 1485.1548 1487.5978 1494.7265 1536.9093 1590.0921 1605.6089 1617.9053 1655.3560 1679.5068 2969.3869 2970.9152 3000.8509 3048.4773 3086.5496 3100.7264 3107.8363 3128.6643 3130.5260 3141.0812 3144.6058 3154.8421 3167.2088 3188.9068 3437.9241
redmass: 5.4100 3.3845 3.9060 1.3531 3.7970 4.7601 3.4079 4.1205 3.5314 3.0383 1.1856 5.7040 1.2924 3.9206 4.7695 3.6520 6.1891 3.0594 3.8658 6.0309 3.0033 6.1938 4.6727 3.4342 5.1883 5.3868 6.3099 5.5903 6.6122 5.8801 6.9056 2.3682 8.7929 3.5479 1.5442 1.4127 5.5175 1.2484 4.8099 1.9036 2.2979 1.3655 4.4481 1.4234 3.6310 4.1163 2.1636 1.4582 2.6637 1.7006 1.7810 1.2536 1.9598 1.5903 3.0983 1.0538 1.1416 3.0109 3.8518 3.4838 1.4546 3.6930 3.9752 8.8839 1.2588 1.1715 1.1829 2.1945 1.0500 1.0599 1.0552 1.0871 1.7361 1.2646 1.0726 2.1177 6.5386 7.2229 8.7432 8.4224 9.0960 1.0409 1.0425 1.0299 1.0958 1.0900 1.1047 1.0981 1.1009 1.0857 1.0893 1.1042 1.0941 1.0994 1.0963 1.0753
irintensity: 0.0664 3.9230 2.7530 1.7855 0.7170 3.2053 2.8584 3.2043 6.0363 6.1322 0.3900 3.0299 2.0639 1.2282 26.6510 0.6581 4.6932 8.2018 22.3929 1.2737 0.4388 14.9294 0.9949 11.9552 21.4541 1.6998 0.8421 11.5672 20.3371 0.6562 3.5753 17.7077 11.4279 83.9512 6.2619 160.0598 1.0977 1.1848 7.2074 11.0999 6.6373 0.7887 0.1291 0.4699 4.7487 201.7806 20.0780 7.5956 9.8496 47.4704 44.1339 0.2768 18.3814 99.6143 20.7546 0.2934 1.5411 4.1380 186.5476 96.1472 38.3515 46.6917 306.9338 1.0177 48.7976 17.8920 10.5181 21.1697 13.6740 25.2777 40.5480 39.2173 116.6467 43.1525 16.9701 524.9781 16.7481 122.1114 257.7983 73.8894 218.8448 9.3946 100.1942 54.2776 19.9843 14.2240 30.6048 12.1138 10.5775 1.0284 12.0249 17.7145 25.4564 19.9680 1.6449 90.5379
temp: 298.150 k
press: 1.00000 atm
elementType: 8 8 8 7 7 7 6 6 6 6 6 6 6 6 6 6 6 6 6 1 1 1 1 1 1 1 1 1 1 1 1 1 1 1
symmnumber: 1
zpe: 697921.7 jmol-1
zpe.correction: 0.265824 hartree
zpe.thermalcorrener: 0.284342 hartree
zpe.thermalcorrenthalpy: 0.285286 hartree
zpe.thermalcorrgfe: 0.218062 hartree
zpe.sumelectzpe: -892.910385 hartree
zpe.sumelectthermal: -892.891867 hartree
zpe.sumelectthermalent: -892.890923 hartree
zpe.sumelectthermalfe: -892.958147 hartree
dipole: 1.1950 3.2667 -0.6555
dipole: 3.5396
quadrupole: -91.0022 -108.4624 -110.7658
quadrupole: 8.1231 0.5177 -0.3703
quadrupole: 12.4079 -5.0523 -7.3557 8.1231 0.5177 -0.3703
hfenergy: -893.1762094 hartree
pointgroup: C01 [X(C13H15N3O3)]
dipole: 0.5153441 -1.1691924 0.5538549 debye
polarizability: 272.5683266|2.8400414|181.0590539|-5.7793693|-6.2847116|98.1819521 unknown
InChI: InChI=1S/C13H15N3O3/c1-9-11(14-13(18)19-3)12(17)16(15(9)2)10-7-5-4-6-8-10/h4-8,14H,1-3H3
charge 0 multiplicity 1
34 atoms
O  -0.057828 2.035725 -0.177379
O  -4.618009 1.128343 -0.47074
O  -4.124204 -1.142605 -0.101046
N  0.59656 -1.418712 0.406526
N  1.042503 -0.06199 0.274894
N  -2.466816 0.554919 -0.127478
C  -0.831062 -1.400843 0.358901
C  -1.246734 -0.098604 0.117707
C  -0.074453 0.786365 0.063328
C  2.403444 0.238776 -0.03752
C  1.273431 -2.199653 1.474447
C  -1.572196 -2.68721 0.583326
C  2.91277 1.522515 0.28471
C  3.228906 -0.720054 -0.679692
C  4.251401 1.833929 -0.032606
C  4.571128 -0.398179 -0.973268
C  5.09012 0.877089 -0.651025
C  -3.745503 0.053013 -0.216222
C  -6.038623 0.753129 -0.610296
H  2.361947 -2.174489 1.315997
H  0.933617 -3.243933 1.405446
H  1.044384 -1.801375 2.483037
H  -1.154674 -3.496469 -0.043733
H  -2.633632 -2.54561 0.33217
H  -1.514251 -3.013506 1.640282
H  -2.352525 1.566355 -0.28462
H  2.257215 2.260805 0.752191
H  2.808204 -1.686922 -0.974589
H  4.640626 2.828643 0.210264
H  5.205635 -1.140376 -1.470256
H  6.130603 1.12483 -0.88654
H  -6.560284 1.703347 -0.79227
H  -6.404318 0.271788 0.312588
H  -6.174184 0.059862 -1.457832
