program: Gaussian 09
title: 000202374
version: EM64L-G09RevD.01
frameworkgroup: C1[X(C20H21ClN2O)]
method: RPBEPBE
basis: SDD
operation: Freq
keyword: #p
keyword: freq=noraman
keyword: PBEPBE/SDD
title: #p freq=noraman PBEPBE/SDD
converged: YES YES NO NO
title: Mulliken charges:
elementType: Cl O N N C C C C C C C C C C C C C C C C C C C C H H H H H H H H H H H H H H H H H H H H H
charge: -0.057013 -0.239224 -0.055042 -0.238558 -0.365876 -0.419926 0.245972 0.357298 -0.545698 -0.495887 0.244596 0.283770 0.099396 -0.373047 -0.312464 -0.352826 -0.391101 -0.371118 -0.256356 -0.346934 -0.245714 -0.163601 -0.241789 -0.685238 0.280848 0.214101 0.228263 0.213247 0.241958 0.261370 0.215753 0.243115 0.203457 0.248143 0.290489 0.234976 0.247944 0.229795 0.237267 0.198788 0.227964 0.258776 0.206162 0.219853 0.224109
chargesum: 0.00000
title: Mulliken charges with hydrogens summed into heavy atoms:
elementType: Cl O N N C C C C C C C C C C C C C C C C C C C C
charge: -0.057013 -0.239224 -0.055042 -0.238558 -0.085028 0.022437 0.245972 0.357298 -0.090493 -0.018764 0.244596 0.283770 0.099396 -0.129932 -0.021975 0.098774 -0.156125 -0.123174 -0.026561 0.089121 -0.017750 -0.163601 0.016988 -0.035114
polarizability: 2.77208645e+02 4.91261323e+00 2.38509187e+02 7.70686955e+00 1.55554227e+01 1.97912222e+02
1716.lowfreq: -7.9592 -1.8597 -0.0021 -0.0017 -0.0014 2.9327 15.7291 38.9648 44.5222
frequency: 15.1268 38.9099 44.4755 56.2200 64.5229 83.1998 97.5709 119.9113 146.0985 149.0265 189.0469 221.2688 222.6948 235.8866 242.2547 259.5366 287.1850 312.0489 331.9969 334.2804 350.9243 376.2576 402.2740 412.6147 435.5482 456.1008 479.1961 485.4308 506.2407 521.1992 532.1642 573.3666 588.4764 628.7360 639.7994 662.8881 689.9133 725.0394 740.4249 742.9759 749.9107 754.0232 782.1551 810.8097 821.1259 848.4976 855.9436 877.2901 887.4665 888.9698 907.5977 930.4632 944.2611 945.7074 955.9452 969.0720 988.2943 1000.0162 1036.6064 1046.9548 1054.6836 1061.4986 1083.4759 1090.9732 1109.3562 1118.0320 1128.0537 1131.2722 1145.5485 1166.0747 1174.8975 1196.8656 1201.6032 1214.7996 1223.4182 1240.3053 1252.0588 1252.6971 1273.2157 1275.6129 1290.3157 1301.9226 1308.3757 1321.8507 1341.5424 1345.1620 1355.3440 1364.7303 1373.3234 1385.3054 1386.5100 1391.6514 1404.6937 1440.3173 1445.0941 1449.6526 1462.9956 1466.9182 1473.9827 1479.0663 1480.7727 1485.1520 1491.5466 1569.4311 1588.8209 1594.1744 1605.4028 1616.0247 2863.1361 2872.8229 2972.6758 2977.7248 2981.9152 2986.0197 3019.5396 3034.5414 3039.2436 3039.7750 3065.1519 3072.3361 3081.7988 3090.4630 3113.9388 3118.1671 3139.2340 3146.9885 3161.0723 3161.6428 3174.4244
redmass: 3.1910 4.5166 4.4618 5.3252 5.5011 1.9935 4.9533 4.8154 3.9119 5.1009 4.4796 2.7217 1.3403 3.1744 3.5831 3.5612 3.9727 4.4142 4.5826 3.2994 4.5041 3.8099 4.3485 4.1174 3.0066 3.2728 4.7098 5.7839 3.9263 5.2009 4.4636 4.2232 3.3882 5.7632 4.9371 4.9186 4.0189 3.2028 2.3585 2.8879 1.5660 2.2084 2.4658 2.3600 1.5677 1.7958 2.4882 1.5947 2.0987 1.8993 2.0187 2.3398 2.6508 1.3570 1.4560 2.2723 1.3240 2.1477 2.5509 3.0606 2.2589 2.9924 2.0688 2.7402 2.2128 3.2002 2.5158 2.1788 1.7881 1.7267 1.0650 1.2433 1.7210 1.7296 1.7043 1.6676 1.3518 1.6028 1.9100 1.4269 1.2725 1.3450 1.6530 1.2972 1.5848 2.0495 1.7865 1.3989 3.2233 5.8821 1.6139 1.2070 3.5473 2.2497 1.1467 1.1168 1.7441 1.3688 1.0598 1.0441 1.0964 1.0742 2.5033 7.9474 7.3430 7.0022 7.9502 6.4207 1.0709 1.0705 1.0822 1.0359 1.0605 1.0611 1.0596 1.0912 1.0981 1.0984 1.0887 1.1009 1.0993 1.1052 1.0868 1.0894 1.0928 1.0888 1.1002 1.0921 1.0966
irintensity: 0.1133 0.4260 0.1759 0.3813 1.9958 0.4640 1.4900 1.4751 0.1634 0.1386 0.6429 0.6318 0.6098 1.9828 2.0917 2.6975 1.5140 4.4284 2.1853 5.8870 0.8048 4.4092 2.8216 0.4256 2.1161 10.6145 5.0680 8.7385 4.3506 12.0005 19.8860 6.4356 2.4289 9.4443 14.6704 6.6992 2.3543 1.4767 22.0382 5.4051 58.4143 8.0933 5.7558 9.7246 33.2735 11.5753 12.3227 5.4767 5.8428 10.8396 6.5647 0.8183 1.1211 0.7223 1.9087 12.8415 0.0719 2.9655 4.5843 4.5382 6.9621 6.2826 22.3524 14.9963 10.1053 38.7390 21.0894 17.2047 26.6182 12.0914 1.1293 23.4456 3.0830 9.3804 1.3410 9.5777 20.2045 2.1028 30.0312 25.6799 14.5798 0.3326 34.1369 4.5554 6.0253 12.9429 9.7174 1.7478 20.6756 0.3250 18.0769 10.7948 38.5160 4.5911 14.2856 16.4571 102.0400 64.3440 3.6570 9.3668 6.8544 15.6696 18.5694 6.3596 93.1340 5.6673 230.1295 1.7364 34.0675 88.9711 12.8972 40.8592 26.0504 20.2945 33.9549 37.6277 24.3152 2.1071 15.6943 27.3920 34.7591 31.1491 14.0117 2.8833 25.7715 7.6421 30.1224 1.2051 4.3803
temp: 298.150 k
press: 1.00000 atm
elementType: 17 8 7 7 6 6 6 6 6 6 6 6 6 6 6 6 6 6 6 6 6 6 6 6 1 1 1 1 1 1 1 1 1 1 1 1 1 1 1 1 1 1 1 1 1
symmnumber: 1
zpe: 957784.6 jmol-1
zpe.correction: 0.364801 hartree
zpe.thermalcorrener: 0.385910 hartree
zpe.thermalcorrenthalpy: 0.386855 hartree
zpe.thermalcorrgfe: 0.313629 hartree
zpe.sumelectzpe: -1417.792453 hartree
zpe.sumelectthermal: -1417.771343 hartree
zpe.sumelectthermalent: -1417.770399 hartree
zpe.sumelectthermalfe: -1417.843625 hartree
dipole: 0.4367 1.6982 0.5736
dipole: 1.8449
quadrupole: -139.2225 -164.3947 -140.8485
quadrupole: -18.4360 -6.6961 -2.3632
quadrupole: 8.9327 -16.2395 7.3067 -18.4360 -6.6961 -2.3632
hfenergy: -1418.1572536 hartree
pointgroup: C01 [X(C20H21Cl1N2O1)]
dipole: 0.047995 0.7242044 0.0073987 debye
polarizability: 274.2005626|12.3957065|247.1627977|0.3494227|1.0209018|192.2666939 unknown
InChI: InChI=1S/C20H21ClN2O/c1-2-10-23-18-8-7-15(21)12-17(18)20-16-6-4-3-5-14(16)9-11-22(20)13-19(23)24/h3-8,12,20H,2,9-11,13H2,1H3
charge 0 multiplicity 1
45 atoms
Cl 0.567756 4.523511 -1.617051
O  -2.593962 -2.912153 -0.469402
N  0.515048 -1.615668 -1.018142
N  -2.423711 -0.591837 -0.289744
C  0.44573 -0.586751 0.068131
C  1.623717 -1.385243 -1.976132
C  1.823129 -0.308318 0.665518
C  -0.289897 0.681076 -0.410907
C  2.966304 -1.556728 -1.248824
C  -0.784269 -1.811655 -1.718816
C  3.018305 -0.747784 0.038509
C  -1.708236 0.625159 -0.576246
C  -1.986653 -1.84092 -0.765851
C  1.898776 0.410108 1.885782
C  0.392486 1.874892 -0.746018
C  -3.625777 -0.568359 0.58807
C  4.264881 -0.451845 0.648427
C  -2.414034 1.768136 -1.029013
C  3.140784 0.69591 2.487121
C  -3.265606 -0.718211 2.084161
C  4.334581 0.262519 1.861808
C  -0.331388 2.990035 -1.201328
C  -1.732587 2.962363 -1.339743
C  -4.525623 -0.68044 2.974539
H  -0.178565 -1.033014 0.868167
H  1.564114 -0.37596 -2.454454
H  1.533398 -2.135242 -2.782954
H  3.800733 -1.269642 -1.917226
H  3.097123 -2.62928 -1.005407
H  -0.759337 -2.790565 -2.225748
H  -0.963248 -1.021067 -2.489677
H  0.971402 0.74901 2.364342
H  -4.170616 0.37807 0.424197
H  -4.273512 -1.407085 0.279547
H  1.476456 1.936132 -0.613586
H  5.188015 -0.79008 0.161172
H  -3.498958 1.72114 -1.167392
H  3.180647 1.249258 3.431618
H  -2.734118 -1.677991 2.223388
H  -2.570391 0.092805 2.378644
H  5.306936 0.481097 2.317082
H  -2.276842 3.841534 -1.695722
H  -5.068495 0.277473 2.863971
H  -5.221938 -1.498097 2.710984
H  -4.260654 -0.795793 4.040604
