program: Gaussian 09
title: 000202261
version: EM64L-G09RevD.01
frameworkgroup: C1[X(C9H11N3O3S)]
method: RPBEPBE
basis: SDD
operation: Freq
keyword: #p
keyword: freq=noraman
keyword: PBEPBE/SDD
title: #p freq=noraman PBEPBE/SDD
converged: YES YES NO NO
title: Mulliken charges:
elementType: S O O O N N N C C C C C C C C C H H H H H H H H H H H
charge: 0.354242 -0.192358 -0.193597 -0.225305 -0.184848 -0.178362 0.038980 -0.401264 -0.313829 0.228023 0.277415 0.241859 -0.705439 -0.594629 -0.596195 -0.344046 0.258191 0.248409 0.238914 0.234243 0.232564 0.269469 0.262847 0.256581 0.271705 0.254853 0.261579
chargesum: 0.00000
title: Mulliken charges with hydrogens summed into heavy atoms:
elementType: S O O O N N N C C C C C C C C C
charge: 0.354242 -0.192358 -0.193597 -0.225305 -0.184848 -0.178362 0.038980 -0.401264 0.192772 0.228023 0.277415 0.241859 0.000282 0.194267 0.191942 -0.344046
polarizability: 1.78014953e+02 6.24753709e+00 1.37381299e+02 1.88308173e+00 -7.89470389e-01 1.15234459e+02
1716.lowfreq: -11.5358 -8.7335 -7.0708 0.0015 0.0016 0.0024 27.6683 35.4974 63.7013
frequency: 27.6245 35.4046 63.6879 92.6298 96.7257 100.3341 114.9388 118.2754 151.4116 155.0915 170.0515 202.8452 246.2391 300.6376 303.7294 303.7467 310.4759 359.7502 373.7725 381.1146 390.1853 428.2270 437.0788 447.4722 515.1359 552.3552 631.3436 648.8525 676.2668 706.9228 712.3999 788.5582 792.0475 882.4764 910.2276 968.9648 1008.7908 1047.2609 1075.7503 1078.8575 1128.8898 1130.0730 1167.8231 1198.9494 1218.6027 1262.1009 1299.3307 1325.2709 1339.6636 1342.1487 1390.1321 1425.1099 1435.5313 1442.8684 1471.4215 1472.8880 1480.3752 1481.3616 1481.5746 1483.3740 1588.3452 1596.7761 1648.6876 2094.1411 2994.0963 3021.2291 3022.3987 3029.6176 3083.9296 3092.4289 3107.2874 3116.3871 3117.8823 3150.3572 3151.2047
redmass: 10.6460 8.2243 4.0880 1.5169 2.1237 1.1024 3.5873 3.1186 5.9879 7.1708 5.6540 1.2443 5.1896 2.2305 4.8236 3.8635 3.4902 3.9757 12.3128 6.7715 8.1775 11.8013 6.8480 11.3848 5.0829 7.0412 16.9003 9.1583 6.2985 3.1548 9.7338 7.4093 1.6714 3.6111 3.0051 1.9398 3.2678 3.0786 1.9756 2.0309 1.3123 1.3101 2.3896 6.2061 3.9336 3.1094 1.3112 1.4060 4.2994 4.4062 1.1969 1.1785 1.2948 1.0886 1.0641 1.0628 1.0493 1.0892 1.0568 1.0471 10.1341 9.6289 9.5691 12.7496 1.0352 1.0330 1.0331 1.0599 1.1016 1.0987 1.1036 1.1027 1.1025 1.1027 1.1029
irintensity: 1.3098 0.5201 0.5279 2.6939 1.0349 0.6053 7.7847 0.5948 1.4001 1.3155 4.5259 0.4357 3.2721 3.0612 0.6816 0.3101 5.5024 12.0207 0.7315 26.5190 19.6004 0.2103 22.3721 5.2798 7.7883 6.6976 0.2363 1.3509 2.0079 4.7978 14.2476 1.6806 0.8209 7.1425 0.6292 34.0371 0.1799 45.0855 24.6351 32.7373 0.1865 0.0688 14.1244 3.6702 56.0951 35.5165 37.4451 14.2246 181.9954 158.1165 16.2384 24.9996 195.4956 41.2426 4.6271 35.1198 21.3069 15.0336 4.7241 12.2747 163.7417 602.2397 19.5457 6.0825 21.7504 16.6549 17.0179 3.9467 5.1158 22.6570 12.2299 9.0802 11.6981 0.3445 0.5539
temp: 298.150 k
press: 1.00000 atm
elementType: 16 8 8 8 7 7 7 6 6 6 6 6 6 6 6 6 1 1 1 1 1 1 1 1 1 1 1
symmnumber: 1
zpe: 516786.3 jmol-1
zpe.correction: 0.196833 hartree
zpe.thermalcorrener: 0.214272 hartree
zpe.thermalcorrenthalpy: 0.215216 hartree
zpe.thermalcorrgfe: 0.150645 hartree
zpe.sumelectzpe: -1136.354945 hartree
zpe.sumelectthermal: -1136.337507 hartree
zpe.sumelectthermalent: -1136.336562 hartree
zpe.sumelectthermalfe: -1136.401133 hartree
dipole: -3.6285 -0.9983 0.8474
dipole: 3.8575
quadrupole: -116.6105 -104.7304 -98.4172
quadrupole: -4.4447 1.1380 0.0833
quadrupole: -10.0244 1.8556 8.1688 -4.4447 1.1380 0.0833
hfenergy: -1136.5517785 hartree
pointgroup: C01 [X(C9H11N3O3S1)]
dipole: -1.4450079 0.2949619 -0.3580979 debye
polarizability: 178.8177089|-2.7861278|136.676182|-0.1612614|0.2357679|115.1368201 unknown
InChI: InChI=1S/C9H11N3O3S/c1-4-9(16-5-10)6(13)11(2)8(15)12(3)7(9)14/h4H2,1-3H3
charge 0 multiplicity 1
27 atoms
S  1.256105 0.309097 1.787536
O  -0.803284 2.609394 0.36816
O  1.409062 -1.277281 -1.331181
O  -2.940337 -1.538535 0.334653
N  -1.867792 0.532354 0.396013
N  -0.744787 -1.442748 -0.445339
N  3.901409 -0.8579 1.285056
C  0.583536 0.645231 -0.078413
C  1.583412 1.542715 -0.82017
C  -0.742626 1.360639 0.227663
C  0.461901 -0.754146 -0.690285
C  -1.902042 -0.862834 0.123496
C  1.115917 1.881907 -2.256117
C  -3.147397 1.136408 0.848525
C  -0.851968 -2.871377 -0.835674
C  2.810168 -0.381845 1.434104
H  2.554751 1.019751 -0.861682
H  1.703975 2.470987 -0.236256
H  1.009539 0.973086 -2.873501
H  0.160347 2.435132 -2.251688
H  1.871286 2.525975 -2.739021
H  -2.95806 2.199385 1.052742
H  -3.498855 0.619771 1.75496
H  -3.915057 1.031576 0.065012
H  0.124853 -3.178798 -1.234335
H  -1.632489 -2.998944 -1.602825
H  -1.121362 -3.475702 0.044667
