program: Gaussian 09
title: 000202247
version: EM64L-G09RevD.01
frameworkgroup: C1[X(C9H8Cl3NO)]
method: RPBEPBE
basis: SDD
operation: Freq
keyword: #p
keyword: freq=noraman
keyword: PBEPBE/SDD
title: #p freq=noraman PBEPBE/SDD
converged: YES YES NO NO
title: Mulliken charges:
elementType: Cl Cl Cl O N C C C C C C C C C H H H H H H H H
charge: 0.000568 0.010722 0.019962 -0.266740 -0.238776 0.589624 -0.315671 -0.307166 -0.635285 0.188982 -0.075947 -0.193334 -0.103236 -0.762853 0.288578 0.230808 0.282161 0.241095 0.286956 0.243760 0.250163 0.265630
chargesum: 0.00000
title: Mulliken charges with hydrogens summed into heavy atoms:
elementType: Cl Cl Cl O N C C C C C C C C C
charge: 0.000568 0.010722 0.019962 -0.266740 -0.238776 0.589624 -0.315671 -0.018589 0.118779 0.188982 -0.075947 0.093622 -0.103236 -0.003300
polarizability: 1.96593208e+02 4.50200448e+00 1.32410218e+02 -2.22136981e+00 2.36280058e+00 8.18646483e+01
1716.lowfreq: -5.4429 -2.6134 -0.0017 0.0004 0.0010 3.8674 20.5176 52.1726 68.3438
frequency: 20.4038 52.1615 68.3436 91.7778 105.3229 138.0668 143.5630 166.3786 180.8426 183.3679 230.4453 265.0259 303.8843 311.8820 340.9798 386.1425 436.3128 461.5695 477.8386 518.3707 567.2860 581.3896 622.2939 642.7564 672.1724 713.4827 796.9055 859.2673 891.9265 924.6827 965.8679 1028.5035 1035.5035 1088.0672 1116.6970 1124.0764 1149.9674 1228.0487 1263.7047 1316.4161 1341.9294 1362.3705 1380.7488 1415.4978 1447.7588 1450.0872 1468.1613 1479.4979 1484.9341 1544.8961 1576.9109 1616.2959 2980.6235 2997.5031 3066.3288 3084.9836 3111.8399 3135.1523 3167.7322 3181.0343
redmass: 4.2812 10.6625 6.9887 8.1675 1.1271 2.2280 1.1303 7.2109 24.2745 9.8349 5.2916 5.4873 6.5927 16.1854 6.4254 5.2432 3.2982 11.7187 3.8125 5.3751 4.1058 4.8957 7.2534 5.4108 6.5520 3.8422 7.2808 1.4516 1.4459 3.3992 1.9146 3.8994 1.7954 2.1197 2.9566 1.2921 2.1077 1.1990 6.0911 6.0066 5.6165 5.9715 1.2549 1.2603 1.8580 1.3833 1.0490 1.1060 1.0561 9.7580 8.3596 7.2949 1.0334 1.0377 1.1029 1.0976 1.0992 1.0994 1.0930 1.0932
irintensity: 0.2600 0.4154 2.6074 1.1187 1.0925 3.9755 1.1389 0.4005 0.1145 0.4152 2.0455 0.6947 1.6434 0.9517 4.1701 4.6045 2.3321 8.5140 19.9422 2.5882 16.5694 38.0562 6.5826 8.6302 2.1292 1.2394 19.0004 10.1644 16.4299 17.0172 29.9918 74.0646 29.7661 25.6880 54.7044 0.0785 60.6029 0.9658 51.0168 89.8054 44.1839 48.6074 46.6334 36.4571 93.0106 176.6601 21.7960 39.8149 27.4429 0.3086 21.5905 269.8625 46.3218 5.8609 22.3510 8.7035 0.1752 11.3492 0.7249 1.4048
temp: 298.150 k
press: 1.00000 atm
elementType: 17 17 17 8 7 6 6 6 6 6 6 6 6 6 1 1 1 1 1 1 1 1
symmnumber: 1
zpe: 393367.9 jmol-1
zpe.correction: 0.149826 hartree
zpe.thermalcorrener: 0.164674 hartree
zpe.thermalcorrenthalpy: 0.165618 hartree
zpe.thermalcorrgfe: 0.105750 hartree
zpe.sumelectzpe: -1856.886812 hartree
zpe.sumelectthermal: -1856.871964 hartree
zpe.sumelectthermalent: -1856.871020 hartree
zpe.sumelectthermalfe: -1856.930888 hartree
dipole: -2.1450 0.7991 -0.4546
dipole: 2.3337
quadrupole: -126.9577 -100.5229 -97.5514
quadrupole: 2.9164 -2.4491 1.2017
quadrupole: -18.6137 7.8211 10.7926 2.9164 -2.4491 1.2017
hfenergy: -1857.0366377 hartree
pointgroup: C01 [X(C9H8Cl3N1O1)]
dipole: 0.884152 -0.1916884 -0.1566748 debye
dipolederiv: -0.3257834 -0.2853827 -0.0264998 -0.3213012 -0.4980869 -0.0215049 -0.0158211 -0.0165658 -0.0461023 -0.3363789 -0.3025727 -0.0115681 -0.3952703 -0.5016791 -0.011311 -0.0212855 -0.0153281 -0.0194563 -0.7468524 0.0938887 -0.0881243 0.1374343 -0.0748834 0.0186457 -0.1102849 0.0161462 -0.0281322 -1.3613604 0.1768485 0.1575419 0.1706314 -0.3634343 -0.0238491 -0.0503412 0.0069642 -0.5596563 -1.1109348 0.0969782 0.1890881 0.1252725 -0.3267897 -0.0295397 0.4212126 -0.0775797 -0.8450404 0.8315942 -0.246747 -0.0050565 -0.1681657 0.0586103 -0.0137976 0.2156736 -0.0489273 -0.0428611 0.327616 0.4992845 0.0604132 0.5212328 0.7063472 0.0294119 0.0248253 0.023679 -0.0677709 -0.2356994 -0.0720071 0.0194104 -0.1221505 -0.1647716 -0.0083203 -0.0142364 -0.0077287 -0.0675539 -0.1501427 0.0692148 0.1389989 0.0713697 0.2010795 -0.0212144 0.1576833 -0.0279891 0.4294868 1.7919572 -0.2817749 -0.4109844 -0.2909762 0.1878387 0.0559575 -0.7357303 0.1204701 1.1373748 0.2290453 0.6138773 -0.0115227 0.5804656 0.7207862 0.0245309 -0.0031879 0.0465437 -0.0454617 -0.3690901 -0.0752594 -0.0455921 -0.1071623 -0.1713826 -0.0189341 -0.0446828 -0.0006959 -0.0335114 1.0513185 -0.306845 0.1584332 -0.2283699 0.0065988 -0.0278117 0.1667937 -0.0473507 -0.0359392 -0.0293926 0.0179318 -0.1550668 0.0268141 0.0257137 0.0490678 -0.0153511 0.0072756 -0.3648527 0.0732421 0.028357 -0.0166564 0.0406091 0.0296645 0.0065083 -0.0087842 0.0077603 0.1467632 0.083551 -0.1122786 0.0747599 -0.0786004 -0.0277136 0.1060745 0.0391662 0.0388402 -0.0432282 -0.0031483 0.0207221 -0.0926499 0.0178664 0.127836 0.016207 -0.0190311 0.0062775 0.1575089 0.134632 0.055696 0.0345906 0.0204505 -0.0760904 -0.1185868 0.0365823 -0.0380449 -0.0173706 0.0743256 0.0115338 -0.0093221 0.0182205 0.0391339 0.0088434 -0.0129729 0.0100854 0.1642578 -0.0044664 -0.103665 -0.04241 -0.1257979 0.0330467 -0.0217241 -0.0228933 0.0309801 0.0723376 0.1012467 0.0618976 -0.0305383 0.0700022 -0.0520322 0.0408514 -0.0367832 -0.0148922 0.0796007 -0.0252791 0.0403022 0.1127551 0.0374254 0.1202083 -0.0395049 0.0494489 -0.0199199 0.0296074 unknown
polarizability: 193.9024686|12.9273098|134.8846316|6.3689046|-0.1903978|82.0809739 unknown
InChI: InChI=1S/C9H8Cl3NO/c1-5(14)13(2)9-4-7(11)6(10)3-8(9)12/h3-4H,1-2H3
charge 0 multiplicity 1
22 atoms
Cl -0.868765 -2.707793 -0.207909
Cl 2.986753 2.427145 0.040427
Cl 4.211483 -0.611468 0.376624
O  -3.905972 0.602569 0.263519
N  -1.740899 0.256261 -0.51953
C  -0.343202 0.042285 -0.282168
C  0.213668 -1.25511 -0.141435
C  0.538445 1.149873 -0.227699
C  -2.195883 0.256576 -1.927598
C  -2.681455 0.414738 0.518697
C  1.920126 0.96993 -0.026542
C  1.592313 -1.452539 0.058765
C  2.447495 -0.332724 0.117055
C  -2.141395 0.332072 1.942363
H  0.127865 2.157247 -0.343505
H  -1.697832 1.060305 -2.499807
H  -3.283741 0.429244 -1.91785
H  -1.982601 -0.716234 -2.406751
H  2.001354 -2.459819 0.169259
H  -1.30334 1.029691 2.113456
H  -1.781251 -0.689234 2.163992
H  -2.963367 0.574783 2.630935
