program: Gaussian 09
title: 000202235
version: EM64L-G09RevD.01
frameworkgroup: C1[X(C15H15NO2)]
method: RPBEPBE
basis: SDD
operation: Freq
keyword: #p
keyword: freq=noraman
keyword: PBEPBE/SDD
title: #p freq=noraman PBEPBE/SDD
converged: NO YES NO NO
title: Mulliken charges:
elementType: O O N C C C C C C C C C C C C C C C H H H H H H H H H H H H H H H
charge: -0.295447 -0.253525 -0.003581 -0.177418 0.524196 -0.718479 -0.416759 -0.379312 0.436375 -0.383738 -0.393585 -0.804894 0.225958 0.218539 -0.264811 -0.413812 -0.180574 -0.317722 0.249348 0.223478 0.228749 0.232707 0.247904 0.228106 0.231669 0.228692 0.224673 0.226135 0.238442 0.277192 0.280818 0.234769 0.245907
chargesum: 0.00000
title: Mulliken charges with hydrogens summed into heavy atoms:
elementType: O O N C C C C C C C C C C C C C C C
charge: -0.295447 -0.253525 -0.003581 0.071930 0.524196 -0.033545 -0.168855 -0.151206 0.436375 -0.152069 -0.164893 -0.115644 0.225958 0.218539 0.012381 -0.132995 0.054195 -0.071815
polarizability: 2.12907254e+02 -2.97399390e+00 1.39444763e+02 9.27194039e+00 -7.86787383e+00 1.64661504e+02
1716.lowfreq: -14.5538 -5.3227 0.0007 0.0008 0.0010 3.2445 6.7747 19.4376 25.8406
frequency: -14.5210 18.9780 25.7804 25.8941 58.1740 98.6396 107.9362 155.5731 184.5387 203.9591 228.4351 253.7427 287.4068 294.6934 349.2778 374.4727 401.1249 406.8691 422.6476 436.5582 485.0866 533.6190 567.9404 610.4768 637.6592 677.7495 695.9678 718.4331 719.7234 732.9832 785.9510 804.6458 822.9840 830.0252 832.3226 848.8352 943.5255 954.4729 967.9930 973.8254 985.4178 990.3902 998.7698 1000.9639 1013.9497 1022.1468 1045.6729 1048.4938 1066.4317 1103.8679 1117.3992 1141.1110 1193.7270 1199.0648 1220.0429 1224.2528 1237.8927 1298.5423 1308.3107 1313.0700 1324.5651 1337.6171 1388.7982 1389.8454 1399.3230 1411.3774 1413.9215 1453.1551 1462.5627 1472.8758 1473.2142 1475.5349 1510.1545 1551.2215 1582.2016 1586.6025 1617.5278 1624.5926 2976.1602 2996.3489 3037.9982 3057.6011 3086.1482 3096.0666 3099.9234 3117.4857 3122.1418 3134.2607 3142.1822 3148.6273 3152.4814 3160.0264 3182.6408
redmass: 1.0135 4.0971 5.6265 4.1374 8.0537 4.3271 4.2062 4.6798 3.0820 2.3021 1.4526 3.8847 4.2678 5.4914 2.8504 2.9270 3.8902 3.1810 4.5727 4.4566 5.0694 2.9000 3.7909 7.7665 6.8814 6.8709 7.2130 2.6310 2.1113 2.8417 3.9861 6.1677 3.9235 1.7471 1.7595 1.2560 1.3607 1.3423 1.5144 1.3937 1.5238 3.4871 2.0703 1.3884 2.7719 4.8563 1.8243 1.6026 2.2499 2.0031 1.5941 1.5629 1.1192 1.3062 2.0941 3.0255 2.9266 1.5305 1.7182 4.1275 1.2562 1.7576 3.7004 1.2467 1.2235 2.1794 2.2441 2.1417 1.0546 1.1014 1.0549 1.0531 2.6820 5.9768 5.9509 5.9653 11.4010 6.3976 1.0387 1.0356 1.0865 1.0950 1.0998 1.0992 1.1002 1.0874 1.0879 1.0886 1.0957 1.0970 1.0925 1.0935 1.0982
irintensity: 0.5902 1.5998 0.3589 1.6642 0.3647 0.1399 1.3672 0.0659 0.5863 2.2033 0.5826 8.7651 3.1842 1.7906 2.4707 0.5285 1.7305 0.6492 0.6073 2.6873 7.2991 28.4481 13.2182 1.6704 0.2412 0.8570 6.1034 8.3942 46.3598 13.6184 36.6110 8.4811 51.3693 19.5667 14.4261 1.0383 1.2720 2.6778 3.0003 0.1718 23.1704 187.4844 8.9257 0.1929 15.1742 6.6893 154.9543 51.4704 47.5365 9.0514 33.8667 6.3046 10.8261 5.2989 32.6091 2.2932 298.0688 14.7938 19.2992 8.3096 3.8848 9.6467 2.4513 18.0371 11.8851 16.0334 4.8563 6.6157 7.7599 17.6330 13.1652 7.0827 15.9078 18.0896 32.6640 1.1446 152.7685 12.7155 33.3635 16.2245 6.7201 23.4378 17.1381 23.9033 34.1592 10.8866 18.1293 10.4606 29.5570 0.7801 4.2386 18.2532 8.2197
temp: 298.150 k
press: 1.00000 atm
elementType: 8 8 7 6 6 6 6 6 6 6 6 6 6 6 6 6 6 6 1 1 1 1 1 1 1 1 1 1 1 1 1 1 1
symmnumber: 1
zpe: 687814.6 jmol-1
zpe.correction: 0.261975 hartree
zpe.thermalcorrener: 0.277925 hartree
zpe.thermalcorrenthalpy: 0.278869 hartree
zpe.thermalcorrgfe: 0.215743 hartree
zpe.sumelectzpe: -784.515215 hartree
zpe.sumelectthermal: -784.499265 hartree
zpe.sumelectthermalent: -784.498320 hartree
zpe.sumelectthermalfe: -784.561446 hartree
dipole: 2.2125 1.3468 -3.4631
dipole: 4.3246
quadrupole: -101.6118 -102.9051 -101.5078
quadrupole: -7.9196 11.3268 1.9348
quadrupole: 0.3964 -0.8969 0.5005 -7.9196 11.3268 1.9348
hfenergy: -784.7771895 hartree
pointgroup: C01 [X(C15H15N1O2)]
dipole: -0.8515534 0.4978109 1.3863123 debye
polarizability: 213.0830355|5.3719431|139.6312435|7.8298723|7.9167874|164.2992421 unknown
InChI: InChI=1S/C15H15NO2/c1-11-5-7-13(8-6-11)12(2)18-15(17)14-4-3-9-16-10-14/h3-10,12H,1-2H3
charge 0 multiplicity 1
33 atoms
O  0.508196 1.300625 0.115705
O  0.801492 0.366902 -2.009757
N  4.533614 -1.251479 -0.74152
C  -0.850615 1.841094 -0.308479
C  -1.910822 0.777385 -0.069282
C  -1.022731 3.134118 0.491226
C  -2.523387 0.13432 -1.17232
C  -2.310236 0.404243 1.239286
C  -3.923505 -1.223897 0.332041
C  -3.519264 -0.846316 -0.97376
C  -3.300177 -0.580941 1.43412
C  -4.970089 -2.303577 0.546138
C  1.207412 0.555904 -0.836256
C  2.493866 0.031267 -0.287785
C  2.907942 0.256865 1.049177
C  3.339679 -0.727556 -1.140243
C  4.141172 -0.279165 1.474842
C  4.916046 -1.021049 0.551956
H  -0.778365 2.051232 -1.390838
H  -1.008305 2.943015 1.577933
H  -1.990024 3.602695 0.237556
H  -0.212839 3.844768 0.253886
H  -2.206901 0.395097 -2.188829
H  -1.845075 0.880718 2.109908
H  -3.984313 -1.328805 -1.841957
H  -3.597494 -0.856692 2.453476
H  -5.529907 -2.145981 1.484851
H  -5.695963 -2.334072 -0.285332
H  -4.499757 -3.304353 0.608083
H  2.270549 0.836347 1.722211
H  3.037203 -0.915619 -2.175833
H  4.499476 -0.129359 2.497885
H  5.879623 -1.452837 0.846009
