program: Gaussian 09
title: 000202274
version: EM64L-G09RevD.01
frameworkgroup: C1[X(C23H27NO)]
method: RPBEPBE
basis: SDD
operation: Freq
keyword: #p
keyword: freq=noraman
keyword: PBEPBE/SDD
title: #p freq=noraman PBEPBE/SDD
converged: YES YES NO NO
title: Mulliken charges:
elementType: O N C C C C C C C C C C C C C C C C C C C C C C C H H H H H H H H H H H H H H H H H H H H H H H H H H H
charge: -0.315974 -0.077334 -0.002942 -0.576403 -0.481397 -0.440755 0.278121 0.294641 0.390080 0.375153 -0.392545 -0.436800 -0.473510 -0.470493 -0.288356 -0.385498 -0.355846 -0.366660 -0.255833 -0.234227 -0.235526 -0.235190 -0.394907 -0.387921 -0.398831 0.239825 0.240949 0.238256 0.227904 0.232871 0.253080 0.277054 0.241577 0.240388 0.219906 0.200728 0.194193 0.215726 0.172204 0.205315 0.213042 0.167184 0.224189 0.222864 0.223783 0.222169 0.191762 0.204838 0.203738 0.192018 0.214126 0.189262
chargesum: 0.00000
title: Mulliken charges with hydrogens summed into heavy atoms:
elementType: O N C C C C C C C C C C C C C C C C C C C C C C C
charge: -0.315974 -0.077334 -0.002942 -0.336578 -0.002193 0.020020 0.278121 0.294641 0.390080 0.375153 -0.139464 -0.159747 -0.231933 -0.230105 0.132277 0.024422 0.021674 0.013566 -0.031645 -0.011363 -0.011743 -0.013020 0.001693 0.007836 0.004556
polarizability: 2.92700413e+02 -6.89822568e+00 2.63071018e+02 1.15486190e+01 3.97388676e+00 1.84343910e+02
1716.lowfreq: -5.9662 -0.5970 -0.0007 0.0003 0.0006 8.3991 12.1386 22.8041 38.2279
frequency: 11.9776 21.4820 38.0658 65.2536 72.4144 97.7099 123.3529 145.7959 154.7870 160.1041 171.9062 210.1839 217.8624 231.6850 237.1971 282.5483 318.7610 332.3323 346.4728 360.4114 382.6476 404.8426 418.6749 429.0848 448.6814 452.4580 460.1596 474.8078 514.8054 534.9536 564.0807 577.3666 604.7949 610.1138 628.8605 677.6695 718.8561 751.1329 759.4803 763.4103 767.9394 772.0433 801.8294 807.3325 814.8304 826.8126 846.4570 855.0037 855.9654 877.9848 880.2639 888.4673 894.9467 906.0496 947.1079 951.8130 957.1490 959.4975 984.7716 987.7926 993.4234 1003.8450 1021.4340 1024.1716 1031.4337 1037.1246 1041.1078 1050.6830 1060.0337 1084.1662 1098.3691 1103.1986 1115.6751 1123.2592 1128.4602 1142.9343 1150.0051 1159.8134 1161.0315 1169.4087 1171.0756 1175.6238 1180.9782 1192.9488 1197.6272 1214.9723 1242.7581 1245.0660 1258.4561 1259.6567 1266.4444 1279.1530 1282.8374 1293.3033 1301.1594 1310.5132 1319.2578 1325.1131 1331.9438 1340.6850 1347.6489 1354.8863 1370.8434 1390.6836 1393.6672 1398.3560 1443.1432 1445.8912 1450.9209 1455.5186 1460.6575 1461.4293 1462.3610 1464.8321 1467.9496 1472.6549 1480.2414 1484.2346 1495.3598 1590.0186 1598.7035 1612.0018 1620.3505 2816.3894 2828.1424 2880.7905 2962.4012 2967.7307 2985.4441 2986.0609 3000.4809 3014.2830 3022.2204 3025.3027 3029.4070 3036.1532 3046.0977 3047.3303 3052.0829 3055.2538 3057.9270 3081.6130 3118.6573 3119.0093 3130.1988 3131.7283 3146.1098 3152.2962 3161.0301 3172.1211
redmass: 3.1577 4.1834 3.9583 4.7401 3.6577 3.8768 2.8554 3.9913 3.7818 2.5899 3.2517 1.8573 3.2674 4.6324 1.9669 3.5940 2.2465 3.4732 3.9568 3.5937 1.9724 4.6488 3.4185 4.3933 2.9380 3.4027 3.7950 4.8940 4.0996 2.4489 3.3748 3.8188 3.8657 4.2422 5.2762 5.8043 5.5865 3.5170 1.4592 3.1479 1.3461 1.9281 1.4373 3.3041 1.2089 3.0181 3.9039 1.4288 2.9538 2.4126 1.3457 1.7574 1.8832 2.2548 1.4185 1.4222 1.9147 2.4980 1.3176 1.3738 2.5548 3.7813 2.2959 2.7244 2.4143 3.3036 2.5156 2.1394 2.9197 2.7018 1.7375 1.7174 1.9648 2.1152 1.7621 1.3603 1.3135 2.2071 1.3802 1.1198 1.1888 1.2326 1.9138 2.6777 1.3851 1.9091 1.5367 1.3385 1.3622 1.8713 1.1851 1.4536 1.1962 1.3941 1.5081 1.5930 1.3729 1.4504 1.3140 1.4221 1.4888 1.4180 1.4035 6.0492 8.0715 1.4664 2.3443 2.5476 1.0915 2.3881 1.0872 1.0912 1.0843 1.0901 1.6668 1.0888 1.0944 1.4890 1.0865 6.5839 7.2937 7.0763 7.1928 1.0715 1.0699 1.0699 1.0575 1.0622 1.0618 1.0608 1.0582 1.0632 1.0945 1.0872 1.0912 1.0934 1.1031 1.0966 1.0874 1.1037 1.1049 1.1057 1.0861 1.0859 1.0892 1.0904 1.0936 1.0965 1.0998 1.0962
irintensity: 0.1905 0.1821 0.3106 0.7402 0.1225 0.0378 0.7441 0.7184 2.6579 1.4924 0.5444 0.0057 2.1134 3.6012 0.2331 4.8610 1.8928 0.7492 1.1867 1.0851 2.4745 2.2443 3.9068 0.9573 0.3446 1.9225 2.9838 1.1107 0.3953 1.4392 29.6345 0.3917 4.9188 3.3035 5.4739 1.1716 3.8643 2.3677 22.5438 5.5610 109.4181 12.0265 0.6450 0.7971 1.5183 0.1185 0.4721 5.1719 6.8632 3.0143 0.2468 9.8983 0.9974 1.0284 0.8760 2.3401 11.7745 15.0048 0.3009 1.2339 17.2662 5.5745 6.8651 3.3289 4.5386 15.2953 16.4863 10.7427 157.8128 1.4496 1.6975 26.0947 19.3774 6.8985 11.5586 14.1721 5.8727 43.8565 7.2175 2.8191 2.9679 1.0587 2.3068 10.2898 0.8708 16.9205 6.0642 4.3404 3.9911 1.1824 4.5884 2.0586 7.1846 12.3777 50.0134 4.2689 6.2570 0.5099 0.8748 0.4919 2.2977 0.6180 4.3437 2.8716 0.0604 0.0496 14.7166 9.1407 7.0586 31.1498 12.6666 5.7082 7.1731 10.8715 0.5738 2.4219 8.5186 12.7624 3.3547 2.0819 1.0758 0.2316 1.2202 45.8777 136.5446 97.8393 34.4822 39.2220 33.6262 32.4685 31.7009 39.5115 27.4979 54.2084 72.4571 23.5118 29.0436 50.7118 35.8126 99.4241 0.8852 50.0272 0.9325 3.7258 8.6025 19.4441 31.5988 39.1248 31.6101 14.1915
temp: 298.150 k
press: 1.00000 atm
elementType: 8 7 6 6 6 6 6 6 6 6 6 6 6 6 6 6 6 6 6 6 6 6 6 6 6 1 1 1 1 1 1 1 1 1 1 1 1 1 1 1 1 1 1 1 1 1 1 1 1 1 1 1
symmnumber: 1
zpe: 1166353.1 jmol-1
zpe.correction: 0.444240 hartree
zpe.thermalcorrener: 0.465423 hartree
zpe.thermalcorrenthalpy: 0.466368 hartree
zpe.thermalcorrgfe: 0.392806 hartree
zpe.sumelectzpe: -1020.777827 hartree
zpe.sumelectthermal: -1020.756645 hartree
zpe.sumelectthermalent: -1020.755700 hartree
zpe.sumelectthermalfe: -1020.829262 hartree
dipole: -0.9006 0.8459 1.0146
dipole: 1.5988
quadrupole: -134.3804 -143.3793 -149.0872
quadrupole: 1.6638 7.6435 0.9354
quadrupole: 7.9019 -1.0970 -6.8049 1.6638 7.6435 0.9354
hfenergy: -1021.2220678 hartree
pointgroup: C01 [X(C23H27N1O1)]
dipole: -0.3798697 0.3156273 0.389514 debye
polarizability: 293.0851163|-4.9230903|262.4458609|12.9249933|3.5621731|184.584365 unknown
InChI: InChI=1S/C23H27NO/c1-6-14-24(15-7-1)16-17-25-23-13-12-18(19-8-2-4-10-21(19)23)20-9-3-5-11-22(20)23/h2-5,8-11,18H,1,6-7,12-17H2
charge 0 multiplicity 1
52 atoms
O  -0.234945 -0.831719 -0.230521
N  -3.966193 -0.773428 -0.023309
C  0.960019 -0.203007 0.325704
C  3.233834 0.823319 1.164064
C  0.972634 -0.135538 1.904646
C  2.324761 0.473131 2.402151
C  1.209319 1.226148 -0.182674
C  2.183105 -1.03493 -0.067429
C  2.43198 1.780267 0.287055
C  3.409612 -0.478956 0.385821
C  0.380597 1.960006 -1.051361
C  2.159444 -2.246203 -0.780787
C  2.807314 3.084001 -0.089059
C  4.622655 -1.144377 0.125374
C  -1.524869 -0.456417 0.375747
C  -2.608007 -0.995243 -0.571802
C  -4.458456 0.611696 -0.24242
C  -4.952508 -1.775592 -0.502783
C  0.761814 3.270377 -1.433002
C  3.382838 -2.909813 -1.048573
C  1.965046 3.833528 -0.948036
C  4.607463 -2.363534 -0.597925
C  -5.790635 0.851429 0.496615
C  -6.30191 -1.615192 0.227185
C  -6.852659 -0.180897 0.054069
H  4.196065 1.25394 1.489807
H  0.831281 -1.160815 2.290748
H  0.125282 0.48181 2.250057
H  2.145616 1.390653 2.990631
H  2.859142 -0.245264 3.048793
H  -0.531696 1.505506 -1.451226
H  1.202411 -2.652909 -1.118671
H  3.75175 3.510971 0.268917
H  5.571331 -0.720207 0.47541
H  -1.643781 -0.926954 1.370714
H  -1.59671 0.643869 0.494395
H  -2.471203 -0.541893 -1.584788
H  -2.441809 -2.082543 -0.683401
H  -4.606014 0.811265 -1.338426
H  -3.69494 1.324833 0.118396
H  -4.540048 -2.78485 -0.317795
H  -5.122954 -1.681424 -1.608987
H  0.125999 3.846663 -2.114765
H  3.380696 -3.850891 -1.610398
H  2.254462 4.846588 -1.249633
H  5.5486 -2.883124 -0.811471
H  -6.140995 1.8827 0.297783
H  -5.614781 0.759192 1.585824
H  -6.149083 -1.824894 1.303617
H  -7.021805 -2.360596 -0.162635
H  -7.786558 -0.050818 0.632885
H  -7.106101 -0.011363 -1.013235
