program: Gaussian 09
title: 000202246
version: EM64L-G09RevD.01
frameworkgroup: C1[X(C17H18N2O)]
method: RPBEPBE
basis: SDD
operation: Freq
keyword: #p
keyword: freq=noraman
keyword: PBEPBE/SDD
title: #p freq=noraman PBEPBE/SDD
converged: YES YES NO NO
title: Mulliken charges:
elementType: O N N C C C C C C C C C C C C C C C C C H H H H H H H H H H H H H H H H H H
charge: -0.272205 -0.176356 0.000790 -0.190171 -0.452105 -0.413690 -0.379756 -0.389253 0.422606 0.126158 -0.301154 -0.500214 0.271764 -0.196367 -0.376873 -0.352100 -0.357833 -0.224874 -0.240258 -0.228568 0.292143 0.226600 0.208685 0.220054 0.216747 0.207663 0.206268 0.216914 0.247395 0.255482 0.251050 0.230388 0.264483 0.248048 0.243227 0.231769 0.230933 0.232608
chargesum: 0.00000
title: Mulliken charges with hydrogens summed into heavy atoms:
elementType: O N N C C C C C C C C C C C C C C C C C
charge: -0.272205 -0.176356 0.000790 0.101973 -0.016820 0.023111 0.034175 0.075057 0.422606 0.126158 -0.045672 -0.249164 0.271764 0.034021 -0.112390 -0.104053 -0.114606 0.006895 -0.009325 0.004041
polarizability: 2.56588754e+02 -2.63095234e+00 1.79289344e+02 7.88496913e+00 2.09916055e+01 1.41149093e+02
1716.lowfreq: -17.4442 -1.7586 0.0004 0.0006 0.0007 5.8506 21.5860 34.0086 43.3090
frequency: 21.3539 33.8613 43.2214 64.0343 84.6440 100.3065 135.3370 183.9493 196.5270 221.6945 251.4907 276.5498 288.9239 361.3195 380.5575 392.3127 406.6679 407.7543 440.4613 466.5472 486.4946 552.9225 581.1265 605.5074 613.4471 614.7911 671.5672 693.2399 707.6619 715.6514 725.1393 762.3543 786.5579 813.4492 825.3522 847.6277 859.2742 886.1034 913.1063 924.0948 926.4663 935.8268 944.8433 981.4019 986.8011 989.9486 994.0375 1000.0256 1004.7278 1026.0391 1028.8388 1048.3734 1081.5717 1084.2097 1089.4541 1109.7484 1124.6992 1134.2720 1173.6943 1176.5298 1187.9180 1191.7243 1211.7546 1226.3453 1261.7581 1267.9143 1301.6507 1312.3665 1315.3808 1317.7572 1336.3214 1340.0320 1345.6654 1360.0922 1361.6710 1379.6874 1397.8576 1408.5276 1432.3995 1457.8457 1461.0462 1468.8133 1474.9730 1480.3479 1481.7010 1538.8102 1553.2710 1583.5156 1588.8884 1609.4978 2975.2574 2983.1869 2986.7899 2990.8163 3000.9099 3040.9692 3048.6823 3057.7719 3100.8392 3124.1366 3128.6567 3133.2973 3137.4727 3139.3560 3144.8859 3156.5660 3164.0050 3168.9894
redmass: 4.8632 4.6571 5.3441 5.3474 3.9738 4.5257 3.2922 3.1667 4.8316 4.8078 4.2393 2.8727 3.1569 3.3822 2.6459 3.0055 2.9635 4.0831 3.7144 2.9451 3.5592 3.4006 3.0787 5.7023 6.5651 6.4700 5.0087 5.0493 1.5680 3.9418 1.9277 3.2786 2.2721 1.6569 2.1927 2.1581 1.2532 3.2965 1.7862 1.4138 1.9750 1.4382 1.4767 1.4261 2.0672 5.4337 1.7736 1.3406 3.3533 2.3716 2.9460 2.1529 1.6640 1.7411 1.4772 2.0948 2.5065 1.6165 1.0559 1.8602 1.1520 1.4837 1.6478 1.9806 1.3829 1.5408 2.6788 1.8194 1.5545 1.5269 1.3202 1.3286 1.3582 1.3745 1.4184 8.3514 2.3307 2.0164 2.2348 1.2581 1.5631 1.0968 1.1123 2.2341 1.1271 10.4258 5.4675 5.7914 6.2299 6.0439 1.0698 1.0590 1.0634 1.0742 1.0706 1.0984 1.1009 1.1030 1.0939 1.0855 1.0866 1.0878 1.0908 1.0917 1.0926 1.0960 1.1001 1.1010
irintensity: 0.8782 1.0133 1.9476 3.4594 0.6260 1.6074 0.1621 0.0483 0.2026 5.8151 1.2486 2.9795 5.0157 6.9691 0.6634 2.0349 1.0058 4.2539 4.0985 3.1898 2.9976 5.1976 3.5924 5.4042 4.9457 9.1031 5.3722 5.5199 79.0874 4.1000 28.2761 10.3196 28.8332 2.5439 17.8503 24.6361 0.8625 1.6528 1.5604 7.9983 6.6477 3.7519 5.7846 0.4609 58.9374 5.6805 25.4043 0.2111 0.2861 6.6444 1.0469 3.9948 10.1511 3.0950 2.1445 16.2297 3.2136 23.8809 0.1076 8.4255 5.0598 0.4457 1.3257 9.5785 39.7652 97.2942 13.4490 32.2454 27.3020 27.5477 2.5565 3.4128 5.1578 23.9877 9.5921 0.6977 128.5999 23.8532 8.5144 6.4433 43.3307 6.1999 3.7279 9.1201 14.1253 215.9270 5.8822 0.4136 7.4941 2.5119 23.1954 32.2435 26.3046 34.6253 33.6775 46.5419 34.5356 67.8409 16.8075 3.8594 6.6898 2.6630 23.4247 20.3140 21.9423 20.4811 21.2930 20.3763
temp: 298.150 k
press: 1.00000 atm
elementType: 8 7 7 6 6 6 6 6 6 6 6 6 6 6 6 6 6 6 6 6 1 1 1 1 1 1 1 1 1 1 1 1 1 1 1 1 1 1
symmnumber: 1
zpe: 821371.6 jmol-1
zpe.correction: 0.312844 hartree
zpe.thermalcorrener: 0.329565 hartree
zpe.thermalcorrenthalpy: 0.330509 hartree
zpe.thermalcorrgfe: 0.266702 hartree
zpe.sumelectzpe: -841.904407 hartree
zpe.sumelectthermal: -841.887686 hartree
zpe.sumelectthermalent: -841.886742 hartree
zpe.sumelectthermalfe: -841.950549 hartree
dipole: 2.4346 0.2635 -3.4212
dipole: 4.2073
quadrupole: -123.3260 -105.4130 -125.2679
quadrupole: -1.9275 -5.4253 3.3823
quadrupole: -5.3237 12.5893 -7.2656 -1.9275 -5.4253 3.3823
hfenergy: -842.2172508 hartree
pointgroup: C01 [X(C17H18N2O1)]
dipole: 0.9729782 -0.1716775 1.3280705 debye
polarizability: 256.1781612|5.9526724|176.2851847|-9.1896299|23.2682088|144.5638441 unknown
InChI: InChI=1S/C17H18N2O/c20-17(14-7-2-1-3-8-14)19-12-5-4-10-16(19)15-9-6-11-18-13-15/h1-3,6-9,11,13,16H,4-5,10,12H2
charge 0 multiplicity 1
38 atoms
O  1.071183 -0.252071 -2.284166
N  0.076725 -0.645721 -0.211136
N  -4.5938 0.668717 0.279019
C  -1.23637 -0.885918 -0.884167
C  -1.62049 -2.382235 -0.761954
C  -1.59081 -2.880051 0.702344
C  -0.21048 -2.58929 1.332995
C  0.160041 -1.09168 1.202044
C  -2.282612 0.116811 -0.373064
C  1.161134 -0.278551 -1.010514
C  -1.922545 1.479256 -0.199596
C  -3.637731 -0.222704 -0.12458
C  2.446504 0.148735 -0.344024
C  -2.892652 2.416448 0.209525
C  3.670702 -0.270662 -0.92365
C  2.470163 1.060635 0.743666
C  -4.213962 1.968579 0.442446
C  4.90011 0.182357 -0.400189
C  3.700554 1.530211 1.253563
C  4.918713 1.083877 0.690599
H  -1.046017 -0.663232 -1.952688
H  -0.886903 -2.959357 -1.357251
H  -2.608974 -2.560113 -1.223718
H  -1.807321 -3.964017 0.73751
H  -2.379548 -2.376437 1.295445
H  -0.203971 -2.864527 2.405114
H  0.566573 -3.19828 0.830176
H  -0.535085 -0.481659 1.814048
H  1.180756 -0.920847 1.574115
H  -0.891064 1.794646 -0.392225
H  -3.994616 -1.250737 -0.249151
H  -2.637853 3.472842 0.342136
H  3.640657 -0.934621 -1.79371
H  1.529257 1.425807 1.171952
H  -4.999031 2.661219 0.766683
H  5.840999 -0.155529 -0.848119
H  3.708552 2.246422 2.082592
H  5.873214 1.444677 1.089724
