program: Gaussian 09
title: 000202266
version: EM64L-G09RevD.01
frameworkgroup: C1[X(C24H32N2)]
method: RPBEPBE
basis: SDD
operation: Freq
keyword: #p
keyword: freq=noraman
keyword: PBEPBE/SDD
title: #p freq=noraman PBEPBE/SDD
converged: YES YES NO NO
title: Mulliken charges:
elementType: N N C C C C C C C C C C C C C C C C C C C C C C C C H H H H H H H H H H H H H H H H H H H H H H H H H H H H H H H H
charge: -0.095108 -0.103623 -0.107955 -0.437413 -0.639251 -0.379236 -0.384172 -0.469649 -0.576310 -0.406619 -0.407726 0.402202 0.387130 -0.572248 0.397389 0.383974 -0.550121 -0.522951 -0.480507 -0.478612 -0.465214 -0.459610 -0.227331 -0.232884 -0.220499 -0.223805 0.246352 0.271956 0.308814 0.254006 0.300569 0.320269 0.316796 0.300474 0.247332 0.216057 0.285928 0.299412 0.317109 0.317638 0.297102 0.247485 0.311792 0.285812 0.290997 0.291300 0.262829 0.285301 0.271807 0.285138 0.249907 0.252461 0.260543 0.264598 0.250403 0.251545 0.253665 0.254756
chargesum: 2.00000
title: Mulliken charges with hydrogens summed into heavy atoms:
elementType: N N C C C C C C C C C C C C C C C C C C C C C C C C
charge: -0.095108 -0.103623 0.138397 0.143357 -0.385245 0.241601 0.233098 -0.006260 -0.290382 0.209902 0.207013 0.402202 0.387130 0.272841 0.397389 0.383974 0.295004 0.319295 -0.230600 -0.226151 -0.204671 -0.195011 0.023072 0.018660 0.033166 0.030951
polarizability: 2.81825685e+02 -1.42821405e+01 2.65135499e+02 1.57254330e+01 4.08704388e+00 2.20862484e+02
1716.lowfreq: -8.9019 0.0003 0.0004 0.0006 4.4553 8.8578 18.7111 35.8224 46.3858
frequency: 16.2579 35.5309 46.3340 61.3773 93.1912 112.7791 137.1600 152.8077 164.9489 168.8408 180.4725 208.4239 227.4976 250.6002 254.9625 269.9947 301.5642 303.1693 312.1375 344.0569 347.9822 368.8844 371.6270 411.4370 413.3262 422.4505 432.5814 437.1914 445.8009 458.4400 479.5074 493.4126 495.4502 506.4534 563.3186 572.2855 599.8816 605.5111 638.4767 643.5801 672.4933 686.8815 721.5810 752.8405 759.9936 770.7924 773.1214 777.5016 789.1295 807.3765 814.1403 818.8583 840.2464 850.8140 872.8183 879.7451 886.3646 896.4834 903.1834 916.7883 939.0042 946.6628 957.9886 959.7482 967.5688 981.4393 1002.6176 1003.2825 1003.7956 1009.6314 1023.2298 1025.8656 1037.9812 1052.6480 1055.9527 1068.2233 1085.4266 1093.6901 1106.5441 1119.2562 1132.8122 1148.9991 1166.4311 1170.3205 1175.8018 1179.2860 1180.9322 1183.3251 1185.5002 1196.1335 1197.1652 1202.7802 1209.9712 1212.6996 1224.8106 1233.9418 1257.2979 1263.2655 1282.7883 1292.8324 1297.6464 1309.4465 1314.0500 1325.3071 1330.3361 1339.9508 1344.0363 1363.3428 1373.3067 1380.3588 1392.1016 1395.3508 1403.3368 1423.1850 1435.7853 1442.7194 1447.7647 1450.0201 1452.2331 1453.6326 1455.5876 1456.9756 1463.5773 1464.8135 1468.9693 1471.9413 1477.7824 1482.3048 1485.5924 1489.1589 1490.9720 1495.3619 1593.2686 1601.6091 1610.6195 1619.1066 2981.3647 2988.5975 2997.5227 3025.8523 3027.6153 3032.6553 3034.6461 3038.0522 3038.6960 3042.2581 3042.7567 3051.7887 3068.5166 3082.5171 3100.8751 3104.9903 3111.5200 3115.4409 3119.2359 3127.0895 3137.9903 3138.8431 3146.1394 3146.6925 3147.5035 3149.8072 3153.2949 3155.4706 3158.6837 3158.7128 3172.8878 3174.7349
redmass: 3.5634 4.1020 3.6801 4.7670 3.4733 3.8395 3.7492 3.7377 1.2437 3.7087 3.7533 1.4268 2.6818 1.5363 1.4306 2.0384 3.2541 1.8199 2.2423 2.9484 4.1244 3.7908 2.6039 2.0920 1.9201 3.2405 2.5269 2.4114 2.7646 3.3698 2.7848 3.5183 4.1346 4.0372 3.8295 3.7150 3.7328 4.3638 3.8162 5.3140 3.8209 3.1011 5.2219 4.1013 2.3853 1.5835 2.0044 1.6097 2.5292 3.5059 2.8270 3.1638 2.5284 2.9559 2.7859 2.8544 1.3403 1.7193 2.6194 2.7823 2.7927 2.8041 1.4604 1.7350 2.1113 1.9332 1.3439 1.8621 1.3370 1.7894 2.3102 2.2543 2.1148 2.4165 2.2902 2.1415 1.7993 1.3487 2.0191 1.7622 1.1702 1.4143 1.7086 2.3426 2.0965 1.0959 1.0844 1.5497 1.9278 1.2881 1.4216 1.6588 1.3786 1.7832 1.6472 1.3460 1.5630 1.2995 1.7401 1.2914 1.4153 1.3251 1.3321 1.3867 1.3988 1.3077 1.3330 1.2511 1.2936 1.2723 6.5262 6.3653 1.2957 1.1613 1.1460 1.0940 2.2516 1.0929 1.0943 2.3164 1.1271 1.0747 1.1492 2.1578 1.0559 1.0779 1.1023 2.3706 1.0521 1.0738 1.0729 1.0587 6.2375 6.9846 6.9187 7.0832 1.0704 1.0743 1.0604 1.0323 1.0874 1.0364 1.0355 1.0617 1.0598 1.0601 1.0615 1.1013 1.0885 1.1059 1.1056 1.1062 1.1063 1.1067 1.0898 1.0897 1.0894 1.0897 1.1066 1.1059 1.1049 1.1061 1.0928 1.0930 1.1053 1.1046 1.1000 1.1001
irintensity: 0.2604 1.0460 1.1475 0.5360 1.6314 2.1325 0.6387 1.8528 0.0545 3.7593 4.1743 0.2478 0.6573 0.1267 0.0154 1.0211 0.0732 0.9042 0.1136 0.8836 2.7908 0.0258 0.0183 0.0604 0.4820 1.2732 2.8468 0.3443 1.7279 1.7774 1.0337 0.4663 0.1689 0.9961 47.8039 0.5485 5.9726 2.2675 5.0734 2.2076 0.9881 5.3609 4.0777 0.1961 12.1724 48.0082 55.9004 22.8710 9.4245 92.8000 10.0536 26.7573 3.9046 3.8387 40.2341 3.9995 1.2835 6.1955 13.6949 10.5874 13.1367 12.8824 0.0606 0.7063 3.6190 0.4887 0.4503 10.2420 0.0123 17.0704 1.5969 1.9363 0.3211 5.4817 4.7637 6.7438 0.3198 0.0365 2.3720 7.8537 21.3099 0.6966 3.6737 4.7993 2.3316 0.7464 0.4045 1.8096 1.2883 1.2181 3.0663 0.6640 0.7242 2.3041 3.7105 3.9906 1.1829 1.8963 6.2266 8.8990 0.7002 1.8384 1.6144 0.3633 0.2332 4.5328 2.2017 4.0968 1.8007 1.5356 0.3728 0.4378 5.8141 9.1506 12.9558 5.0553 15.1258 15.2293 6.8084 2.1860 14.8971 4.0327 13.3538 28.6532 46.4262 20.2149 8.2420 28.3491 50.9130 17.4728 146.5713 29.7994 0.0370 0.1598 0.8553 1.5090 25.2565 71.8634 24.2771 0.2113 33.3683 0.1691 13.9339 0.4770 0.4016 3.5538 4.7023 25.2404 11.6241 5.0720 0.8222 0.2698 0.2345 0.6068 7.4933 7.0276 0.7941 1.2951 0.0412 2.7643 11.0416 0.0139 7.8283 9.2506 0.1569 4.7237 12.3738 12.2688
temp: 298.150 k
press: 1.00000 atm
elementType: 7 7 6 6 6 6 6 6 6 6 6 6 6 6 6 6 6 6 6 6 6 6 6 6 6 6 1 1 1 1 1 1 1 1 1 1 1 1 1 1 1 1 1 1 1 1 1 1 1 1 1 1 1 1 1 1 1 1
symmnumber: 1
zpe: 1344918.5 jmol-1
zpe.correction: 0.512252 hartree
zpe.thermalcorrener: 0.534890 hartree
zpe.thermalcorrenthalpy: 0.535834 hartree
zpe.thermalcorrgfe: 0.461280 hartree
zpe.sumelectzpe: -1040.729091 hartree
zpe.sumelectthermal: -1040.706454 hartree
zpe.sumelectthermalent: -1040.705510 hartree
zpe.sumelectthermalfe: -1040.780063 hartree
dipole: -28.8547 -1.1791 1.0411
dipole: 28.8975
quadrupole: 29.7252 -121.5953 -125.7792
quadrupole: 5.1303 9.4460 2.4442
quadrupole: 102.2750 -49.0456 -53.2295 5.1303 9.4460 2.4442
hfenergy: -1041.2413434 hartree
pointgroup: C01 [X(C24H32N2)]
dipole: -11.3665912 0.0188935 0.2406358 debye
polarizability: 280.1343079|-14.0302927|266.5599189|17.5544707|0.7294064|221.1294412 unknown
InChI: InChI=1S/C24H32N2/c1-25(2)12-14-26(3,15-13-25)17-18-16-23-19-8-4-6-10-21(19)24(18)22-11-7-5-9-20(22)23/h4-11,18,23-24H,12-17H2,1-3H3
charge 2 multiplicity 1
58 atoms
N  -2.425951 0.209873 0.492769
N  -5.356509 -0.160333 -0.346788
C  0.136849 -0.475295 0.266743
C  -0.97819 0.535204 -0.068365
C  1.253037 -0.338321 -0.872491
C  -3.341348 1.377011 0.08076
C  -2.952356 -1.064853 -0.185273
C  0.824253 -0.243339 1.664884
C  2.361597 0.048498 1.46644
C  -4.832164 1.118681 0.338288
C  -4.44173 -1.330147 0.072075
C  2.324005 -1.37212 -0.538691
C  1.85005 1.06027 -0.720287
C  -2.380837 0.056123 2.012288
C  2.9353 -1.156037 0.724112
C  2.452466 1.268402 0.551513
C  -5.40607 -0.001509 -1.871814
C  -6.784853 -0.442059 0.150109
C  2.7264 -2.443722 -1.358447
C  1.859028 2.078375 -1.69404
C  3.954953 -2.014168 1.175669
C  3.059852 2.502229 0.852873
C  3.756701 -3.305347 -0.906899
C  2.477236 3.318328 -1.392126
C  4.365876 -3.09168 0.351816
C  3.071137 3.528477 -0.125557
H  -0.239428 -1.515619 0.19332
H  -1.127039 0.608303 -1.163007
H  -0.730606 1.539749 0.319018
H  0.811511 -0.508153 -1.872036
H  -3.134921 1.587911 -0.981934
H  -3.035431 2.266577 0.656935
H  -2.376563 -1.921538 0.199994
H  -2.725993 -0.973882 -1.260849
H  0.709751 -1.134015 2.309387
H  0.378028 0.620688 2.193765
H  2.842695 0.214921 2.444144
H  -5.056638 1.019261 1.413412
H  -5.413907 1.973187 -0.047241
H  -4.748691 -2.221721 -0.500541
H  -4.648537 -1.529777 1.136788
H  -3.384101 -0.149425 2.413094
H  -1.702575 -0.770037 2.264513
H  -1.992695 0.987642 2.450005
H  -5.792532 -0.93335 -2.31196
H  -6.084518 0.829387 -2.11841
H  -4.406566 0.208771 -2.276149
H  -7.155377 -1.36139 -0.328788
H  -6.775525 -0.566685 1.243938
H  -7.431831 0.405039 -0.124813
H  2.270772 -2.601117 -2.343242
H  1.433905 1.905238 -2.690488
H  4.437595 -1.847589 2.145049
H  3.540704 2.663707 1.824113
H  4.092862 -4.133138 -1.539474
H  2.515603 4.109071 -2.148436
H  5.167922 -3.757408 0.686379
H  3.56069 4.483052 0.092851
