program: Gaussian 09
title: 000202187
version: EM64L-G09RevD.01
frameworkgroup: C1[X(C12H21N)]
method: RPBEPBE
basis: SDD
operation: Freq
keyword: #pfreq=noraman
keyword: PBEPBE/SDD
title: #p freq=noraman PBEPBE/SDD
converged: NO YES NO NO
title: Mulliken charges:
elementType: N C C C C C C C C C C C C H H H H H H H H H H H H H H H H H H H H H
charge: -0.107800 -0.004911 -0.458130 -0.457856 -0.009232 -0.412171 -0.409938 -0.383344 -0.802363 -0.421625 -0.661477 0.188377 -0.504922 0.200678 0.198258 0.233613 0.192796 0.189436 0.173092 0.198317 0.188872 0.191962 0.197182 0.197416 0.188850 0.231998 0.240747 0.217456 0.201719 0.257991 0.234442 0.246999 0.188366 0.275201
chargesum: 0.00000
title: Mulliken charges with hydrogens summed into heavy atoms:
elementType: N C C C C C C C C C C C C
charge: -0.107800 0.195767 -0.026258 -0.075624 0.163860 -0.024982 -0.020795 0.002922 -0.112162 0.038086 0.008329 0.188377 -0.229721
polarizability: 1.68570529e+02 1.12058249e+01 1.20879131e+02 4.31318876e+00 9.59466620e-01 1.06671385e+02
1716.lowfreq: -18.9453 -5.8264 -0.0010 -0.0002 0.0004 8.4443 34.9178 48.0452 78.8050
frequency: 34.7552 47.8215 78.7984 92.0867 136.6545 173.5987 206.5560 225.0137 232.5693 256.7656 262.6379 309.7182 317.7111 340.9813 353.7480 402.4647 432.8218 438.9779 451.5531 493.9000 575.3023 615.7598 626.8328 659.1327 762.3404 780.1276 790.7709 836.8971 862.3638 890.8294 902.2253 915.4390 933.2765 953.1652 978.9907 1008.8551 1025.9194 1046.5196 1059.2215 1065.5307 1079.5682 1102.3796 1112.0769 1120.8535 1144.1293 1156.6928 1189.1580 1214.4860 1237.0155 1254.5629 1259.9651 1262.9542 1289.8697 1297.3180 1316.1608 1331.2144 1332.5783 1340.3931 1343.5502 1346.7578 1362.2412 1368.8936 1390.0266 1434.0963 1456.4800 1459.4136 1462.7632 1465.0043 1470.5025 1473.8527 1480.9187 1482.4742 1490.2669 1497.9539 2142.5062 2789.1281 2815.3824 2862.1246 2958.0513 2960.7416 2962.5632 2963.6790 2964.5374 2975.0278 2993.4091 3016.5207 3023.7144 3025.5963 3035.2209 3044.0611 3048.5902 3049.7089 3083.1149 3095.8190 3098.7574 3427.7087
redmass: 4.0640 2.7064 2.9795 2.8646 2.9185 3.3369 1.4337 1.7145 1.3283 2.1940 2.3806 2.2610 3.1259 2.2111 2.1506 2.8692 3.0056 2.7713 2.7915 1.6313 3.6278 2.4194 1.2298 1.2479 2.6315 2.7115 1.5631 2.7632 1.6191 1.7279 2.1329 1.7595 2.3912 1.9977 2.1196 2.2635 1.5270 1.8482 1.3980 1.2758 1.4656 1.6209 2.5399 2.4397 1.8463 2.4686 1.7136 2.0367 1.3199 1.2613 1.2774 1.3392 1.3881 1.1943 1.3006 1.4271 1.3948 1.4530 1.4464 1.3835 1.3819 1.4596 1.2208 1.1622 1.0825 1.0892 1.0886 1.0845 1.0772 1.0689 1.0795 1.0585 1.0472 1.0497 6.0332 1.0804 1.0707 1.0572 1.0600 1.0631 1.0613 1.0687 1.0704 1.0698 1.0370 1.0986 1.0950 1.1005 1.1011 1.1003 1.0748 1.0818 1.0989 1.0979 1.1002 1.1590
irintensity: 0.2370 0.3394 0.5363 0.2476 0.5208 0.7950 0.3394 0.1235 0.3905 1.0274 0.6796 4.2396 1.1585 4.6958 0.9819 4.6458 0.2916 0.3456 0.3323 1.5914 1.0959 1.0114 75.9573 64.0934 4.3316 9.1912 1.2118 11.2087 0.8381 13.7247 8.5208 0.1460 5.1685 12.0056 12.5421 16.3806 2.6019 4.8363 25.4520 13.9103 3.6929 0.4041 0.1113 15.0483 6.1258 10.1525 5.5669 21.5491 7.6002 8.7743 2.0641 0.7182 8.4419 1.9472 9.0210 8.7470 3.3927 1.0625 2.7297 10.2600 5.4536 2.1559 31.2065 9.5689 0.7914 7.0738 6.1034 12.3848 14.9495 1.6036 4.9365 6.3438 20.0472 13.5767 3.4398 71.5911 103.2532 121.9026 41.3993 29.0290 39.0716 17.5063 14.4987 37.2231 22.7736 75.3663 79.7916 24.4609 53.3807 79.2937 51.7888 10.6394 41.5761 26.5911 27.3021 65.5743
temp: 298.150 k
press: 1.00000 atm
elementType: 7 6 6 6 6 6 6 6 6 6 6 6 6 1 1 1 1 1 1 1 1 1 1 1 1 1 1 1 1 1 1 1 1 1
symmnumber: 1
zpe: 795164.8 jmol-1
zpe.correction: 0.302862 hartree
zpe.thermalcorrener: 0.317445 hartree
zpe.thermalcorrenthalpy: 0.318389 hartree
zpe.thermalcorrgfe: 0.261615 hartree
zpe.sumelectzpe: -523.491406 hartree
zpe.sumelectthermal: -523.476823 hartree
zpe.sumelectthermalent: -523.475879 hartree
zpe.sumelectthermalfe: -523.532654 hartree
dipole: 0.5830 0.7277 0.7828
dipole: 1.2175
quadrupole: -81.4627 -79.9633 -82.4952
quadrupole: 0.8966 -0.8583 -1.2738
quadrupole: -0.1556 1.3437 -1.1881 0.8966 -0.8583 -1.2738
hfenergy: -523.7942686 hartree
pointgroup: C01 [X(C12H21N1)]
dipole: 0.2369973 0.3288525 0.2551702 debye
polarizability: 168.9161934|11.1199204|120.5279315|1.6246919|-1.5081196|106.6769194 unknown
InChI: InChI=1S/C12H21N/c1-4-10-13(3)11(2)12-8-6-5-7-9-12/h1,11-12H,5-10H2,2-3H3
charge 0 multiplicity 1
34 atoms
N  -1.431217 -0.001725 0.178711
C  1.08505 0.187242 0.282827
C  1.372446 -0.853167 -0.828376
C  2.291134 1.149868 0.448099
C  -0.265522 0.947666 0.093395
C  2.668306 -1.644129 -0.527336
C  3.586612 0.362908 0.763493
C  3.877164 -0.697352 -0.326743
C  -0.299626 1.74126 -1.235729
C  -2.728744 0.69736 -0.06424
C  -1.477265 -0.757123 1.454312
C  -3.89575 -0.205244 -0.089164
C  -4.904676 -0.91319 -0.118142
H  1.020509 -0.367236 1.242177
H  1.486606 -0.332334 -1.80135
H  0.507214 -1.534763 -0.931458
H  2.083993 1.884842 1.25278
H  2.451029 1.729547 -0.483868
H  -0.331462 1.687821 0.940123
H  2.876372 -2.360238 -1.34628
H  2.522966 -2.247033 0.393754
H  3.477416 -0.143796 1.74514
H  4.442172 1.060086 0.856728
H  4.781363 -1.279998 -0.062325
H  4.096675 -0.181342 -1.284829
H  0.66658 2.245137 -1.404111
H  -0.489027 1.063527 -2.087104
H  -1.071563 2.530425 -1.235256
H  -2.920511 1.49362 0.704507
H  -2.676837 1.204808 -1.042289
H  -0.647415 -1.479559 1.50921
H  -2.417836 -1.330699 1.495066
H  -1.430107 -0.09511 2.356012
H  -5.777948 -1.53868 -0.147335
