program: Gaussian 09
title: 000202164
version: EM64L-G09RevD.01
frameworkgroup: C1[X(C8H9BrN4O)]
method: RPBEPBE
basis: SDD
operation: Freq
keyword: #p
keyword: freq=noraman
keyword: PBEPBE/SDD
title: #p freq=noraman PBEPBE/SDD
converged: YES YES NO NO
title: Mulliken charges:
elementType: Br O N N N N C C C C C C C C H H H H H H H H H
charge: -0.010902 -0.366653 -0.450100 -0.250945 -0.623923 -0.641903 0.471388 -0.440076 -0.331563 -0.153373 -0.165527 -0.236122 0.183728 0.285989 0.228569 0.313688 0.324707 0.246396 0.245147 0.313366 0.345331 0.406639 0.306137
chargesum: 0.00000
title: Mulliken charges with hydrogens summed into heavy atoms:
elementType: Br O N N N N C C C C C C C C
charge: -0.010902 -0.366653 -0.125393 -0.250945 0.034774 0.070873 0.471388 -0.211506 -0.017875 0.093023 0.079620 -0.236122 0.183728 0.285989
polarizability: 2.90116389e+02 -7.37870877e-01 1.24319340e+02 3.94552691e-03 -2.01450698e-02 5.19553772e+01
1716.lowfreq: -5.9406 -3.8724 -0.0007 -0.0002 0.0003 1.6407 32.9513 53.8202 75.1332
frequency: 32.9455 53.8030 75.1311 89.6646 133.6560 182.5119 189.5734 195.2520 272.4071 286.5993 327.6115 353.5023 384.4417 411.6366 431.0322 475.8975 492.8202 510.7766 538.5174 621.3147 641.6385 661.6951 695.9814 704.7378 736.3291 765.7995 815.3099 825.3427 843.9794 850.8590 906.5803 941.0436 985.0600 987.2492 998.6559 1049.7778 1060.7965 1111.7544 1121.0866 1185.1524 1246.6247 1293.1164 1302.0679 1366.8776 1395.6260 1442.3099 1475.0010 1493.7127 1538.2494 1558.8334 1585.6053 1602.8591 1608.4461 1655.0665 3124.0324 3161.9942 3170.8236 3190.1946 3261.2404 3539.0189 3558.4247 3625.6083 3712.7556
redmass: 7.5164 4.0035 6.8760 7.3842 6.3160 7.2996 5.5600 10.0866 1.1511 4.6159 5.0803 5.7914 6.8485 3.0246 4.4275 1.2112 3.0361 2.7694 1.1445 7.0683 6.2856 1.6232 3.6740 3.4292 3.8481 6.8002 1.4105 5.4089 1.2927 1.2328 7.2727 1.3555 1.3129 5.0545 2.4779 1.8060 2.3599 1.4970 1.7272 1.1081 1.7527 1.8605 2.2789 5.1603 4.8850 2.4665 2.2382 2.6537 2.6994 4.2266 4.7684 2.5259 2.1452 1.9888 1.0898 1.0906 1.0950 1.0953 1.0639 1.0758 1.0453 1.0891 1.1052
irintensity: 3.2885 0.0096 1.3474 7.1131 0.0048 3.1660 6.7374 1.7389 18.6009 16.1289 1.2334 6.9506 12.8381 0.0143 8.1139 437.1224 2.8752 38.0912 0.0060 1.4821 4.4467 51.0178 8.5201 3.3885 19.9820 18.6014 47.5778 27.2703 5.4991 242.5960 14.3058 2.2153 4.3774 31.1925 34.5894 35.0165 18.6156 14.2023 2.3572 9.8879 155.6286 9.1699 185.9748 352.9356 71.3143 42.5804 59.0034 1684.8281 206.6010 247.3495 19.7237 112.5898 124.1334 679.2466 15.2522 4.8179 5.3476 12.1773 214.4214 25.2702 92.7280 63.5121 38.4591
temp: 298.150 k
press: 1.00000 atm
elementType: 35 8 7 7 7 7 6 6 6 6 6 6 6 6 1 1 1 1 1 1 1 1 1
symmnumber: 1
zpe: 447740.8 jmol-1
zpe.correction: 0.170535 hartree
zpe.thermalcorrener: 0.183970 hartree
zpe.thermalcorrenthalpy: 0.184914 hartree
zpe.thermalcorrgfe: 0.128736 hartree
zpe.sumelectzpe: -616.971010 hartree
zpe.sumelectthermal: -616.957575 hartree
zpe.sumelectthermalent: -616.956631 hartree
zpe.sumelectthermalfe: -617.012809 hartree
dipole: 7.8120 1.4811 0.0039
dipole: 7.9512
quadrupole: -46.2992 -80.1955 -97.3079
quadrupole: -1.7360 0.0201 0.0049
quadrupole: 28.3016 -5.5947 -22.7070 -1.7360 0.0201 0.0049
hfenergy: -617.141545 hartree
pointgroup: C01 [X(C8H9Br1N4O1)]
dipole: 3.0568586 0.6621028 -0.0557753 debye
dipolederiv: -0.8756911 -0.1028347 0.0184786 -0.1420334 -0.0993312 0.0019028 0.0169889 0.0007726 -0.052775 -0.9851575 -0.0201152 0.0161493 0.1526235 -0.9972579 -0.0313195 0.0236082 -0.0264988 -0.371457 -2.4520098 0.206751 0.0673997 0.5971733 -0.3483894 -0.0173362 0.0839358 -0.0066845 -0.3381004 -2.9815332 -0.0639105 0.0702244 -0.0110062 -0.5909845 -0.0099324 0.0722256 -0.008271 -0.3593473 -1.4933745 -0.4862772 0.0020141 -0.6746203 -0.5595584 0.0264541 -0.0025033 0.022033 -0.7288109 -0.8044757 0.1459198 0.0102985 0.5312304 -1.0635455 -0.031872 0.0257836 -0.0208361 -0.6395487 1.7205323 0.0662484 -0.041295 0.427458 0.0032902 -0.01666 -0.0257744 -0.0066052 0.1179804 -0.3409756 -0.0275352 0.0024591 0.1434059 0.0527473 0.0067441 0.0093829 0.0114126 -0.2138674 -0.3483799 0.0077395 0.0053066 -0.2284813 -0.0474637 0.0110726 -0.0046616 0.004787 -0.1677658 -0.2386588 -0.0657714 0.0016282 -0.096607 0.0675372 0.0088061 0.0007239 0.0077882 -0.0845734 -0.2237526 -0.0189261 0.0030294 -0.0331908 0.0951231 0.0082037 0.0023307 0.0079605 -0.0881228 1.2439148 0.2173997 -0.0295197 0.2683308 -0.0392985 -0.0027367 -0.0277843 -0.0012026 -0.1506288 3.2077767 -0.0879325 -0.085734 -0.4211032 1.1652014 0.0511545 -0.0989458 0.0416555 0.2580577 2.9907048 0.2039535 -0.0677032 -0.5651484 1.3994565 0.0617675 -0.1013468 0.0410125 0.2892354 0.0114538 -0.1028308 0.0001755 -0.0816748 -0.0733366 -0.0074743 0.0008819 -0.0069079 0.169726 0.184745 0.0460806 0.001655 0.0206438 0.0652057 -0.005209 0.0004098 -0.0060069 0.1815649 0.1905648 0.0186807 0.0042561 -0.0047213 0.1500892 -0.0067606 0.0026694 -0.0072824 0.3152812 0.0182453 0.0850637 0.0073065 0.0896129 0.0071925 -0.0085989 0.0074385 -0.0084912 0.1605364 0.0682394 -0.0519346 0.000319 -0.0701999 -0.0391979 -0.0058599 -0.0003707 -0.0064197 0.1553843 0.2082324 0.0389656 0.0064744 0.0315633 0.1534414 -0.01075 0.0044395 -0.0113614 0.3933348 0.2201697 0.0417934 0.0066431 0.1030226 0.2273222 -0.010181 0.0085358 -0.0090416 0.3940706 0.5860762 -0.0705278 -0.0091985 -0.032476 0.2579296 -0.0035368 -0.0072506 -0.0028891 0.3605885 0.0933535 0.0200003 0.0096328 -0.0038019 0.2138275 -0.0078782 0.0092829 -0.0089236 0.3992371 unknown
polarizability: 289.8682931|3.6656897|124.2726151|-6.4283012|2.8595695|52.2501977 unknown
InChI: InChI=1S/C8H9BrN4O/c9-5-1-3-6(4-2-5)12-8(14)13-7(10)11/h1-4,12H,10-11H2
charge 0 multiplicity 1
23 atoms
Br -5.622489 -0.453733 0.063431
O  1.472127 -1.392796 -0.17338
N  0.464222 0.739066 -0.054157
N  2.75035 0.648717 -0.12128
N  5.061244 0.832566 -0.179454
N  4.110011 -1.335904 -0.243107
C  -0.909004 0.411116 -0.030389
C  -1.842045 1.483741 0.037818
C  -1.392178 -0.926196 -0.070813
C  -3.22876 1.235355 0.065614
C  -2.780923 -1.174483 -0.043041
C  -3.686936 -0.097454 0.024734
C  1.575241 -0.105893 -0.12103
C  3.942319 0.025012 -0.181052
H  -1.484483 2.520398 0.069475
H  -0.675801 -1.748068 -0.123423
H  0.720721 1.728514 -0.019697
H  -3.935598 2.068147 0.118122
H  -3.147051 -2.204886 -0.074439
H  6.007961 0.466242 -0.219266
H  4.90272 1.835766 -0.131264
H  3.2228 -1.873557 -0.242184
H  5.023652 -1.78077 -0.288618
