program: Gaussian 09
title: 000202168
version: EM64L-G09RevD.01
frameworkgroup: C1[X(C13H21NO3)]
method: RPBEPBE
basis: SDD
operation: Freq
keyword: #p
keyword: freq=noraman
keyword: PBEPBE/SDD
title: #p freq=noraman PBEPBE/SDD
converged: YES YES NO NO
title: Mulliken charges:
elementType: O O O N C C C C C C C C C C C C C H H H H H H H H H H H H H H H H H H H H H
charge: -0.451121 -0.320623 -0.270376 -0.307158 -0.416926 -0.126438 -0.345905 -0.406411 -0.311459 -0.258883 0.396158 -0.343687 -0.388158 -0.499187 -0.221679 -0.197642 -0.256673 0.228005 0.221312 0.213681 0.209969 0.176064 0.243255 0.233058 0.201117 0.227719 0.242110 0.182085 0.184364 0.353700 0.251573 0.245275 0.233623 0.200167 0.199027 0.224355 0.227292 0.228416
chargesum: 0.00000
title: Mulliken charges with hydrogens summed into heavy atoms:
elementType: O O O N C C C C C C C C C C C C C
charge: -0.097421 -0.320623 -0.270376 -0.063904 0.032391 0.087244 0.040128 0.027763 0.158370 0.107567 0.396158 -0.092113 -0.142884 0.133630 0.002676 0.029649 -0.028257
polarizability: 1.69867065e+02 2.21920928e+01 1.60417034e+02 -1.04039819e+01 3.31280628e+00 1.42147662e+02
1716.lowfreq: -4.9904 -2.9144 0.0006 0.0007 0.0008 7.5754 11.9126 32.3184 34.9535
frequency: 11.5802 32.2418 34.9389 39.0042 63.6182 68.8969 103.9935 111.4009 118.6009 141.3655 156.5128 178.4246 211.7307 224.4015 232.3255 239.1795 283.8293 379.1434 398.0856 404.7458 411.7203 446.3327 472.4619 499.3845 501.6633 535.6921 609.9167 639.8557 691.1273 699.2796 757.8143 780.5968 802.8790 822.7470 845.5844 879.8318 884.6270 889.3139 920.4744 949.1660 961.6798 975.1430 982.6471 984.7184 1017.7882 1022.4469 1058.2930 1062.8677 1073.8904 1083.3257 1090.0099 1105.7435 1116.0557 1137.0342 1143.1829 1158.6026 1167.6638 1168.1991 1177.9382 1215.6502 1219.4612 1229.3169 1246.2767 1267.6874 1275.5633 1286.3661 1312.3073 1323.7278 1349.0247 1354.5834 1375.7807 1383.1400 1388.8469 1395.4922 1440.1065 1443.3756 1454.1244 1457.9487 1458.0925 1467.8975 1474.5963 1479.7047 1482.3654 1490.1393 1500.1691 1593.4445 1611.9286 2856.5620 2902.8580 2917.1314 2922.8803 2948.3058 2980.7977 2989.6780 2992.6972 3001.6280 3020.0975 3039.0809 3056.5592 3069.1250 3101.2825 3128.9245 3137.1465 3155.3416 3164.2888 3173.3717 3417.2113 3528.3864
redmass: 5.0906 3.5609 1.8379 4.5899 4.2975 4.0632 2.2046 3.2888 3.2044 2.7363 3.0993 3.3749 3.3030 1.2312 4.8584 5.2715 3.3218 2.6746 3.5256 3.6080 2.9760 1.2279 3.0694 3.7943 2.8784 4.0935 6.4427 3.8840 2.1231 1.3050 1.6179 1.0817 4.5566 1.2580 3.0785 1.3625 3.2613 1.4779 2.2975 3.2934 1.3828 2.8576 1.2991 5.5227 2.7879 2.0605 2.4415 4.6562 1.8964 1.5803 2.8207 1.5481 1.4457 1.7465 3.1470 1.3996 1.1489 1.1961 1.1690 2.2396 1.5157 1.5111 1.2711 1.1887 1.1000 1.3071 1.3313 1.3251 1.3708 1.3423 1.3430 1.3538 5.9756 1.5121 1.1625 2.2257 1.1770 1.1695 1.0839 1.0639 1.0811 1.2187 1.6846 1.0807 1.0866 6.4872 6.2282 1.0711 1.0533 1.0686 1.0357 1.1055 1.0556 1.0731 1.1024 1.0764 1.0861 1.0913 1.1086 1.1011 1.0969 1.0847 1.0890 1.0928 1.0955 1.1003 1.0740 1.0651
irintensity: 0.0306 0.5815 6.8310 0.1460 1.0770 0.6413 1.1331 0.1790 2.0566 3.7363 7.8523 3.6014 2.6168 4.7028 0.9335 1.1482 6.4765 5.6731 8.8363 4.1246 0.0958 166.7406 24.7549 0.8264 11.6320 10.4804 0.9289 5.6269 31.6674 77.4370 93.9337 5.8004 15.1084 0.6571 12.5949 3.0039 14.6499 7.7204 33.7732 48.3837 0.7967 19.5856 0.8042 5.0123 26.9992 16.3831 29.0074 75.5390 66.8184 30.3244 43.8665 3.6014 2.0485 3.4377 51.8866 1.2577 17.2666 3.7400 41.2911 191.8168 57.8274 20.6918 6.0521 0.1491 1.4089 0.5395 1.9425 8.5526 2.5551 1.6672 26.9493 35.8689 5.4113 28.7438 1.4288 5.0136 87.2425 21.8013 11.4947 14.5711 11.0826 26.6358 44.2824 0.5755 5.5486 22.6056 79.7096 103.4307 55.8606 87.3569 108.2496 63.9057 22.2995 3.5820 75.4945 55.2184 11.6249 54.0482 21.9683 46.9457 33.0239 2.6524 11.3407 28.8510 24.3580 4.5467 1.2241 17.8353
temp: 298.150 k
press: 1.00000 atm
elementType: 8 8 8 7 6 6 6 6 6 6 6 6 6 6 6 6 6 1 1 1 1 1 1 1 1 1 1 1 1 1 1 1 1 1 1 1 1 1
symmnumber: 1
zpe: 846012.2 jmol-1
zpe.correction: 0.322229 hartree
zpe.thermalcorrener: 0.341081 hartree
zpe.thermalcorrenthalpy: 0.342025 hartree
zpe.thermalcorrgfe: 0.271384 hartree
zpe.sumelectzpe: -787.011487 hartree
zpe.sumelectthermal: -786.992635 hartree
zpe.sumelectthermalent: -786.991691 hartree
zpe.sumelectthermalfe: -787.062332 hartree
dipole: 1.5355 -1.6439 0.9622
dipole: 2.4466
quadrupole: -96.3819 -109.5587 -96.5911
quadrupole: 7.2825 7.4913 -3.1091
quadrupole: 4.4620 -8.7148 4.2528 7.2825 7.4913 -3.1091
hfenergy: -787.3337158 hartree
pointgroup: C01 [X(C13H21N1O3)]
dipole: -0.6634928 0.6202891 0.3186529 debye
polarizability: 165.8001277|23.1716262|163.112098|10.984453|-2.1857007|143.5195348 unknown
InChI: InChI=1S/C13H21NO3/c1-16-9-5-8-14-10-12(15)11-17-13-6-3-2-4-7-13/h2-4,6-7,12,14-15H,5,8-11H2,1H3
charge 0 multiplicity 1
38 atoms
O  1.636956 -3.422015 0.456145
O  2.010055 -0.6949 0.396434
O  -5.759238 0.905171 -0.83068
N  -1.592063 -1.617454 -0.294123
C  -0.550722 -2.245792 0.548425
C  0.702502 -2.576335 -0.297954
C  -2.680689 -0.940377 0.447277
C  -3.699041 -0.320976 -0.5300
C  1.405497 -1.310334 -0.805341
C  -4.842812 0.395344 0.194485
C  2.743752 0.493689 0.240831
C  2.916282 1.162533 -0.995985
C  3.322688 1.013378 1.425237
C  -6.88441 1.634865 -0.252556
C  3.674858 2.355956 -1.034073
C  4.075248 2.203049 1.36943
C  4.2571 2.882753 0.139486
H  -0.878186 -3.184394 1.052242
H  -0.267413 -1.526917 1.34065
H  0.40555 -3.187632 -1.171191
H  -2.222984 -0.142882 1.066074
H  -3.213195 -1.628432 1.152605
H  -1.976903 -2.286141 -0.977737
H  -3.18219 0.393193 -1.195781
H  -4.136037 -1.1102 -1.174026
H  2.205617 -1.564896 -1.527212
H  0.661543 -0.628171 -1.258545
H  -5.382705 -0.304828 0.87357
H  -4.452681 1.238004 0.811194
H  2.138356 -2.818716 1.065935
H  2.471231 0.773042 -1.915983
H  3.172424 0.47641 2.367263
H  -7.503699 1.972419 -1.098541
H  -6.542882 2.518795 0.328676
H  -7.49428 0.986753 0.413825
H  3.807688 2.872852 -1.991261
H  4.521455 2.600718 2.287807
H  4.843129 3.806771 0.099497
