program: Gaussian 09
title: 000202203
version: EM64L-G09RevD.01
frameworkgroup: C1[X(C20H23NOS)]
method: RPBEPBE
basis: SDD
operation: Freq
keyword: #p
keyword: freq=noraman
keyword: PBEPBE/SDD
title: #p freq=noraman PBEPBE/SDD
converged: YES YES NO NO
title: Mulliken charges:
elementType: S O N C C C C C C C C C C C C C C C C C C C C H H H H H H H H H H H H H H H H H H H H H H H
charge: 0.600728 -0.608114 -0.051254 0.044469 -0.474405 -0.466696 -0.470279 -0.463376 -0.403743 -0.372278 0.599112 0.602968 -0.377235 -0.353074 -0.622050 -0.427270 -0.445708 -0.248496 -0.254390 -0.230246 -0.227987 -0.239879 -0.239544 0.250284 0.223513 0.213752 0.197438 0.204857 0.172035 0.221898 0.228744 0.210560 0.194041 0.213063 0.169631 0.225582 0.186012 0.223104 0.238452 0.242489 0.289049 0.288484 0.230408 0.230246 0.237606 0.237500
chargesum: 0.00000
title: Mulliken charges with hydrogens summed into heavy atoms:
elementType: S O N C C C C C C C C C C C C C C C C C C C C
charge: 0.600728 -0.608114 -0.051254 0.294753 -0.037140 -0.064401 -0.076347 -0.234632 0.000858 0.010416 0.599112 0.602968 -0.377235 -0.353074 0.012649 -0.188819 -0.203219 0.040553 0.034094 0.000162 0.002259 -0.002274 -0.002044
polarizability: 2.54625736e+02 -1.85353653e+01 2.52697575e+02 3.21173768e+01 9.87168092e+00 2.04616550e+02
1716.lowfreq: -6.8546 0.0008 0.0010 0.0011 8.5140 10.9568 20.9269 29.3752 43.5745
frequency: 18.4198 28.9868 43.5524 58.9172 102.9991 116.7619 123.9774 131.4273 144.4235 166.1738 187.9365 188.9275 217.8654 230.5085 255.9397 279.7305 317.5816 328.8758 342.4309 351.7488 358.5504 379.7009 401.9658 416.6666 424.6473 436.9587 451.2529 476.1527 512.9077 515.5648 546.9049 580.2425 604.4803 633.5158 644.4236 663.3863 731.0082 746.8855 758.7100 764.7554 770.0226 785.4493 801.1951 828.9390 852.0432 855.8639 879.5027 883.0306 897.8238 914.1172 952.2987 954.0606 961.1899 974.3792 991.6737 992.4305 1000.0220 1006.7172 1018.9594 1027.5800 1031.4453 1035.4776 1064.8440 1088.0679 1094.2419 1108.7498 1112.7385 1127.8996 1131.1740 1143.9004 1159.7702 1170.1953 1170.7304 1173.1432 1194.9190 1200.0091 1211.5272 1227.1784 1244.1694 1259.6575 1274.1132 1280.7398 1289.2669 1303.1265 1312.4035 1324.8561 1340.0218 1344.3385 1355.5667 1362.4091 1374.9623 1381.7986 1388.7624 1429.3955 1429.6672 1432.5011 1450.1661 1457.3170 1457.8923 1459.2242 1461.1586 1465.5390 1466.6653 1478.0782 1481.8220 1573.7766 1580.4439 1600.5766 1612.0744 2795.2462 2813.5876 2855.5185 2952.6526 2964.4795 2985.5050 2988.6563 3006.6007 3010.7220 3017.1730 3020.6514 3026.0781 3029.8879 3050.6699 3075.8016 3119.3495 3120.0060 3133.9539 3134.2431 3144.9244 3145.2482 3164.8073 3165.1534
redmass: 3.4574 4.5443 5.4824 4.4687 3.2710 4.1847 4.1573 5.1554 2.4388 5.8817 5.3611 4.8662 2.4101 1.2428 2.9720 2.1385 5.6563 4.1323 3.3788 3.2363 5.4500 3.3609 2.2740 5.0481 3.9080 3.3257 3.6243 3.1287 4.2181 3.8837 2.5218 3.0149 4.3431 5.0641 6.4939 5.7814 3.9607 3.0596 2.6921 1.2562 1.4989 2.6095 15.9075 2.7712 2.4075 1.8163 1.4327 1.4617 1.8622 2.3326 1.5404 1.3907 1.9920 1.5156 1.4631 1.3634 4.2256 3.6131 6.4107 1.8912 2.0702 2.1560 2.0828 2.2534 1.6752 1.6463 1.8723 1.9197 1.6516 1.3977 1.6350 1.0995 1.2792 1.3058 2.3310 2.3600 1.3928 1.5239 1.4618 1.3872 1.3328 1.5959 1.3972 1.2703 1.3367 1.4477 1.4653 1.4062 1.4135 1.5004 1.4321 7.6111 5.0590 1.7381 1.4020 2.1521 2.2244 1.0872 1.1851 1.8636 1.1208 1.1190 1.0908 1.1030 1.0547 5.8742 6.3890 7.0960 7.3394 1.0706 1.0698 1.0570 1.0619 1.0596 1.0686 1.0761 1.0896 1.0884 1.0726 1.0911 1.0912 1.0967 1.1032 1.1010 1.0880 1.0878 1.0881 1.0881 1.0937 1.0937 1.1003 1.1003
irintensity: 0.3128 0.2558 1.8876 0.3723 0.1419 0.1564 0.9478 1.4762 1.1088 11.4528 1.7396 1.4946 0.4630 0.6466 2.6815 0.9971 2.4449 0.6757 4.5759 0.4487 3.7284 4.6173 3.8076 4.4096 0.3799 1.1796 0.5616 4.2555 2.6478 39.3396 0.8507 10.9044 3.5984 1.6661 0.1620 0.4972 0.3337 10.2607 10.8394 32.4517 92.1182 16.0735 41.3955 5.0877 3.2125 5.5503 0.2726 0.1860 2.6953 6.8275 1.1924 1.8655 3.6512 3.0390 0.0315 0.0625 3.9803 4.1146 2.0836 16.9226 6.9598 6.2884 9.9790 0.2931 16.1399 0.6542 6.7622 5.7747 4.1005 6.8357 26.7577 0.8543 3.2863 2.8100 5.4705 3.9976 4.5709 2.7441 6.6363 2.8158 1.4645 21.7036 5.4689 1.6830 2.3612 0.9643 1.4384 0.3429 5.6189 0.7777 3.7661 4.4174 1.2384 12.1730 4.0119 2.2241 29.5503 12.3729 11.8996 7.4646 20.3416 5.7713 0.2473 14.1322 8.2011 2.7953 0.2544 0.1527 2.2586 57.0090 101.0219 190.1634 30.2004 20.9543 31.0093 7.3181 7.2823 26.5895 42.3836 62.4129 59.6307 51.6479 64.6819 35.9541 2.6416 9.7772 0.2493 15.6402 1.2804 11.7076 55.7501 12.1825
temp: 298.150 k
press: 1.00000 atm
elementType: 16 8 7 6 6 6 6 6 6 6 6 6 6 6 6 6 6 6 6 6 6 6 6 1 1 1 1 1 1 1 1 1 1 1 1 1 1 1 1 1 1 1 1 1 1 1
symmnumber: 1
zpe: 998119.7 jmol-1
zpe.correction: 0.380164 hartree
zpe.thermalcorrener: 0.400930 hartree
zpe.thermalcorrenthalpy: 0.401874 hartree
zpe.thermalcorrgfe: 0.329991 hartree
zpe.sumelectzpe: -1302.195424 hartree
zpe.sumelectthermal: -1302.174658 hartree
zpe.sumelectthermalent: -1302.173713 hartree
zpe.sumelectthermalfe: -1302.245596 hartree
dipole: -3.6229 -2.4434 -3.4327
dipole: 5.5569
quadrupole: -151.0926 -134.1518 -144.3662
quadrupole: -7.1121 -7.8890 -3.2182
quadrupole: -7.8891 9.0518 -1.1627 -7.1121 -7.8890 -3.2182
hfenergy: -1302.5755876 hartree
pointgroup: C01 [X(C20H23N1O1S1)]
dipole: -1.3194585 -0.9881915 -1.4360638 debye
polarizability: 256.8647574|-20.3023512|247.8017637|30.6478174|15.0487607|207.2733404 unknown
InChI: InChI=1S/C20H23NOS/c1-21-12-6-7-15(14-21)13-18-16-8-2-4-10-19(16)23(22)20-11-5-3-9-17(18)20/h2-5,8-11,15,18H,6-7,12-14H2,1H3
charge 0 multiplicity 1
46 atoms
S  1.93721 0.597868 1.808243
O  3.298465 1.380026 2.385649
N  -4.490896 -0.499559 0.99601
C  -2.182621 -0.512309 0.014088
C  -0.736644 -0.997304 0.276372
C  -2.769881 -1.063099 -1.310339
C  -3.089751 -0.933548 1.194964
C  0.338797 -0.432405 -0.7153
C  -4.249967 -0.650301 -1.47286
C  -5.07208 -1.07284 -0.240068
C  0.481365 1.089227 -0.617587
C  1.693088 -1.110254 -0.485235
C  1.208743 1.692762 0.43227
C  2.536936 -0.727047 0.579612
C  -5.327926 -0.76209 2.182263
C  -0.053087 1.958454 -1.601862
C  2.177144 -2.124758 -1.348825
C  1.439726 3.072613 0.532311
C  3.81129 -1.268784 0.801722
C  0.137229 3.357059 -1.517998
C  3.445984 -2.712476 -1.138914
C  0.888711 3.917528 -0.45893
C  4.269467 -2.281928 -0.072271
H  -2.197817 0.595452 -0.029904
H  -0.702638 -2.104315 0.215816
H  -0.445531 -0.732644 1.313594
H  -2.694028 -2.17177 -1.302374
H  -2.185309 -0.707356 -2.180959
H  -3.020634 -2.049693 1.324232
H  -2.715446 -0.473786 2.130043
H  0.006713 -0.681664 -1.73999
H  -4.3201 0.44867 -1.585688
H  -4.682791 -1.110885 -2.38191
H  -6.114148 -0.71353 -0.33458
H  -5.109738 -2.195474 -0.189058
H  -4.896203 -0.254559 3.063616
H  -5.425068 -1.851612 2.424567
H  -6.343117 -0.357762 2.018474
H  -0.609475 1.533178 -2.446015
H  1.559393 -2.444282 -2.196988
H  2.061652 3.458413 1.348297
H  4.429336 -0.878936 1.618696
H  -0.288078 4.008635 -2.289227
H  3.799767 -3.495294 -1.81887
H  1.051774 4.99931 -0.409198
H  5.260684 -2.72423 0.07351
