program: Gaussian 09
title: 000202149
version: EM64L-G09RevD.01
frameworkgroup: C1[X(C10H10N2O2)]
method: RPBEPBE
basis: SDD
operation: Freq
keyword: #p
keyword: freq=noraman
keyword: PBEPBE/SDD
title: #p freq=noraman PBEPBE/SDD
converged: NO YES NO NO
title: Mulliken charges:
elementType: O O N N C C C C C C C C C C H H H H H H H H H H
charge: -0.196326 -0.220608 -0.240667 0.003215 0.459915 0.188503 -0.478541 0.465325 -0.384551 -0.406044 -0.193298 -0.729023 0.056734 -0.803337 0.255099 0.278432 0.241981 0.239236 0.247678 0.237675 0.273024 0.229441 0.229979 0.246155
chargesum: 0.00000
title: Mulliken charges with hydrogens summed into heavy atoms:
elementType: O O N N C C C C C C C C C C
charge: -0.196326 -0.220608 -0.240667 0.003215 0.459915 0.188503 -0.223442 0.465325 -0.106118 -0.164064 0.045938 0.029354 0.056734 -0.097761
polarizability: 1.88116295e+02 -7.05302739e+00 1.33754630e+02 1.05552273e+00 -2.64838415e+00 7.11152462e+01
1716.lowfreq: -9.7932 -0.0001 0.0005 0.0009 3.0126 9.4306 40.6123 44.4069 72.6284
frequency: 40.4951 44.3940 72.6180 95.4925 155.4784 175.8856 210.2510 247.5100 268.8582 287.2033 308.2513 330.4535 409.7685 438.0762 491.2462 513.1004 548.3980 602.5719 612.2983 639.4883 668.8014 679.7947 696.6375 794.3936 802.2680 841.3088 888.7047 911.8287 922.4637 987.7216 988.6003 991.5018 993.2774 1037.6605 1040.0385 1050.0866 1094.4380 1123.3780 1171.0523 1182.9311 1246.0552 1307.1177 1347.6905 1382.9388 1401.5468 1407.3000 1437.5313 1447.8170 1457.2642 1474.0374 1476.6818 1480.8596 1499.1772 1597.6835 1618.7144 1741.0338 2976.6054 2981.1729 3057.9664 3063.2153 3091.8309 3097.7299 3134.3914 3152.8949 3157.8657 3181.7838
redmass: 1.3730 2.0141 6.6983 4.6780 1.0231 4.6664 3.0742 3.3420 4.3592 4.4703 7.3895 5.6304 4.2186 2.9942 6.3733 5.0515 6.5468 8.2313 6.5091 6.7923 7.7902 7.4949 2.1936 2.5976 2.2838 7.3119 1.3262 3.0165 1.3969 1.8805 2.0520 2.2319 3.0618 1.7793 1.6019 1.5843 1.8024 4.4525 2.0188 1.0945 3.5785 1.3063 4.2274 7.2543 1.2193 1.2593 2.5553 3.5892 1.0917 1.0870 1.2327 1.2290 2.4489 6.1093 6.5381 12.1705 1.0398 1.0387 1.0940 1.0956 1.0998 1.0997 1.0886 1.0921 1.0935 1.0975
irintensity: 1.2032 1.0677 1.9397 0.8734 0.2808 1.2438 2.6539 0.2861 0.9774 2.6313 1.2474 2.5903 2.4481 5.3816 5.7660 2.1757 14.3684 11.0624 13.3609 9.9760 7.6393 7.8524 23.0247 41.1775 26.8680 1.1328 6.6294 4.5073 3.9530 2.7480 3.0373 6.0835 16.9285 6.9794 0.6511 15.8527 46.5809 50.1545 1.0819 0.9395 0.3271 0.1991 3.4233 1.5083 16.1610 18.9044 2.5606 15.7326 14.0724 16.8518 14.2494 33.8903 22.1656 4.1915 25.4462 572.3914 21.1895 22.5876 12.7248 16.7940 15.3696 6.3540 7.5894 7.5711 13.6930 1.6357
temp: 298.150 k
press: 1.00000 atm
elementType: 8 8 7 7 6 6 6 6 6 6 6 6 6 6 1 1 1 1 1 1 1 1 1 1
symmnumber: 1
zpe: 475979.9 jmol-1
zpe.correction: 0.181291 hartree
zpe.thermalcorrener: 0.194156 hartree
zpe.thermalcorrenthalpy: 0.195101 hartree
zpe.thermalcorrgfe: 0.141079 hartree
zpe.sumelectzpe: -645.944634 hartree
zpe.sumelectthermal: -645.931769 hartree
zpe.sumelectthermalent: -645.930825 hartree
zpe.sumelectthermalfe: -645.984846 hartree
dipole: 8.2754 2.0745 1.4137
dipole: 8.6478
quadrupole: -98.2237 -76.5974 -82.4329
quadrupole: -0.9448 -2.8189 -4.5032
quadrupole: -12.4723 9.1539 3.3184 -0.9448 -2.8189 -4.5032
hfenergy: -646.1259255 hartree
pointgroup: C01 [X(C10H10N2O2)]
dipole: -3.2470798 -0.8317287 0.5833394 debye
dipolederiv: -0.7558006 -0.2574889 0.1677881 0.5571693 -0.2251673 0.0026947 -0.2525455 0.058338 -0.1651158 -1.4968994 0.3387434 -0.0523729 0.4626099 -0.4496986 0.0234538 -0.1109071 0.0301427 -0.3257984 -0.1699018 -0.1951642 0.1074534 -0.5126369 0.3559104 -0.1540024 0.2559059 -0.1484162 0.0916732 0.3882897 0.2925577 -0.177283 0.4765352 -0.44663 0.1134369 -0.1454885 0.12687 -0.1266752 0.5339305 -0.0302848 -0.0018675 -0.0309121 0.1505466 0.0891435 -0.1400181 0.0577836 0.0632125 -0.551664 0.4224816 -0.1639934 -0.2033038 -0.0007547 -0.0684845 0.1338507 -0.0925038 -0.0632063 -0.1588534 -0.1587584 -0.0646306 0.0280949 -0.1161508 0.0158234 -0.0350467 0.0257577 -0.1218149 0.1053695 0.2374522 0.0838032 0.272863 0.2275214 0.0987637 0.1601347 0.1240425 0.024016 -0.1063651 0.0663558 0.0101937 -0.0121113 -0.0732559 0.024006 0.0094975 -0.0052233 -0.1248509 0.0705435 -0.0117332 -0.0222192 -0.1262782 -0.1505937 -0.0036895 -0.0580152 -0.0054045 -0.1566755 0.0015798 -0.0896061 -0.0397038 -0.0734306 0.1055942 0.0841935 -0.0436323 0.0741895 -0.0920773 0.0147917 -0.0046227 0.0226394 0.054113 0.0203737 0.0681038 -0.0152195 0.054559 0.0934924 1.961979 -0.5631232 0.0999164 -0.794205 0.4067504 -0.0081674 0.2154057 -0.0302642 0.19583 -0.0051264 -0.0815388 -0.0383469 -0.0858801 -0.0611742 -0.0470788 -0.1022349 -0.1179116 0.0090655 0.0842625 0.0583382 0.0344225 0.0603943 -0.0116524 -0.057438 0.0540029 -0.0478388 0.1254252 0.0669875 -0.072332 -0.0150193 -0.0621999 0.0669059 -0.0456799 -0.0368044 -0.0131499 0.1497339 -0.1129501 0.0082545 0.0193655 -0.0155423 0.0999567 -0.0156951 0.0216251 -0.012913 0.1476254 0.0374124 0.0625056 0.0294585 0.0691966 -0.0371161 -0.0719136 0.0319521 -0.0723679 0.1259687 0.0063674 -0.0138106 0.1228909 0.0069385 0.0513406 -0.0263731 0.1150282 0.005387 0.0246447 0.0979302 -0.1036994 -0.0266889 -0.0746806 -0.0563349 -0.0323388 -0.0466893 -0.0939337 -0.0098568 -0.0163513 0.0738775 -0.0984092 -0.0012448 0.0951623 0.025059 -0.0446354 0.0481988 0.0788392 0.0306611 0.1053615 -0.0421946 0.0206559 -0.0845973 0.0277019 -0.012272 0.0573823 0.1003021 -0.0983839 -0.03684 0.07623 0.0327994 0.0708698 -0.0395275 0.1156634 0.0096925 0.0643579 0.0721909 -0.0469257 -0.0314323 -0.0489443 0.0621941 -0.0019916 -0.0695571 -0.0324169 -0.1081156 unknown
polarizability: 188.1911952|-6.6951067|133.7123192|-1.6723216|2.0334402|71.0826573 unknown
InChI: InChI=1S/C10H10N2O2/c1-7-4-3-5-9(6-7)12-8(2)10(13)14-11-12/h3-6H,1-2H3
charge 0 multiplicity 1
24 atoms
O  2.833528 1.102899 -0.689862
O  4.175566 -0.781601 -0.003398
N  0.847528 0.309274 -0.161764
N  1.448324 1.433271 -0.703426
C  -0.591636 0.366138 -0.021088
C  1.701123 -0.709521 0.190604
C  -1.379487 -0.75334 -0.366442
C  -2.789512 -0.694738 -0.242022
C  -1.175686 1.567997 0.438018
C  -3.37661 0.508253 0.228452
C  -2.579144 1.627901 0.557234
C  1.349794 -1.996138 0.870817
C  3.039717 -0.287095 -0.120073
C  -3.647671 -1.8820 -0.640353
H  -0.904688 -1.661023 -0.753074
H  -0.540952 2.421055 0.691845
H  -4.465983 0.56761 0.334073
H  -3.051144 2.548156 0.916362
H  0.512719 -1.879846 1.581002
H  1.081506 -2.797111 0.155161
H  2.238238 -2.344366 1.42461
H  -3.165624 -2.840731 -0.379992
H  -4.633666 -1.850549 -0.146072
H  -3.826342 -1.890993 -1.732808
