program: Gaussian 09
title: 000202140
version: EM64L-G09RevD.01
frameworkgroup: C1[X(C14H21NO)]
method: RPBEPBE
basis: SDD
operation: Freq
keyword: #p
keyword: freq=noraman
keyword: PBEPBE/SDD
title: #p freq=noraman PBEPBE/SDD
converged: YES YES NO NO
title: Mulliken charges:
elementType: O N C C C C C C C C C C C C C C H H H H H H H H H H H H H H H H H H H H H
charge: -0.433784 -0.126294 -0.366838 -0.361807 -0.150942 -0.400147 -0.404664 -0.400112 0.379663 -0.401558 -0.460553 -0.376396 -0.416404 -0.361160 0.432722 -0.807560 0.219629 0.171080 0.175824 0.236535 0.204138 0.201860 0.193091 0.193289 0.205109 0.190206 0.214509 0.229359 0.199829 0.255929 0.270827 0.230741 0.227850 0.349915 0.231115 0.230519 0.224475
chargesum: 0.00000
title: Mulliken charges with hydrogens summed into heavy atoms:
elementType: O N C C C C C C C C C C C C C C
charge: -0.083869 -0.126294 0.023872 0.050552 0.053197 -0.005195 -0.006266 0.004603 0.379663 0.027630 -0.204624 -0.105568 -0.185662 -0.133309 0.432722 -0.121450
polarizability: 2.04138645e+02 -1.48398152e+01 1.40418748e+02 5.50725477e+00 1.16758132e+01 1.31086996e+02
1716.lowfreq: -17.3885 -0.0003 0.0003 0.0006 0.2169 5.9742 35.5856 39.8994 51.7233
frequency: 35.5426 39.8313 51.7067 59.3476 74.7363 132.6787 158.4961 171.4432 189.3614 230.9682 267.0412 289.9493 325.5584 328.6051 357.5354 385.5884 397.2819 411.1723 431.7426 450.0944 470.4645 524.8511 557.0735 598.0173 637.8163 717.6284 729.6419 782.6414 803.5360 805.3736 832.3945 857.0171 862.5395 864.3304 907.6380 954.5183 959.6549 967.1559 982.8917 987.9826 993.8901 999.2801 1014.0788 1045.5088 1048.2293 1052.6760 1087.3602 1099.7224 1117.2211 1122.1099 1145.2163 1152.5565 1158.3983 1183.8136 1203.0541 1220.0953 1226.1205 1254.8946 1269.3505 1278.4389 1290.6762 1294.4403 1319.1352 1322.3184 1333.2474 1342.7829 1351.4346 1353.8972 1372.8503 1387.3100 1390.0031 1398.1383 1405.7541 1450.9502 1461.6141 1465.7070 1467.7568 1470.6473 1474.8892 1475.7382 1479.2972 1502.5618 1582.4474 1621.5307 2824.2998 2831.6413 2846.7083 2958.5701 2968.5849 2976.2012 2983.7004 2985.0568 3033.7036 3042.6281 3047.2850 3050.9317 3054.5710 3055.2530 3083.1515 3089.7256 3115.1231 3116.5980 3138.9221 3146.7236 3520.0272
redmass: 1.4376 1.8329 3.5576 3.1688 4.2033 2.7519 3.5721 4.1099 2.8022 1.9522 3.4396 2.5800 3.7705 3.2533 2.7246 1.7643 1.3854 2.4020 3.0964 3.0133 2.4743 2.9275 2.9458 2.3946 6.3138 2.9484 3.3051 3.4070 1.4858 4.4178 1.4932 1.4304 1.8096 1.6235 2.5827 1.4490 1.3409 1.7637 1.4812 1.6481 2.9126 2.3529 2.7903 2.3553 1.5612 2.2043 1.5641 2.2884 1.4027 2.4929 1.8221 1.4428 1.3400 1.1293 2.0753 2.7643 1.9263 1.2482 1.1687 1.2313 1.3676 1.4705 1.2051 1.4359 1.3010 1.4358 1.4963 1.4530 2.3575 1.5578 1.4625 1.2894 2.5005 1.0906 1.0869 1.0834 1.0902 1.0457 1.0979 1.0878 1.0972 2.6674 5.9636 6.3821 1.0718 1.0741 1.0769 1.0674 1.0622 1.0372 1.0610 1.0616 1.0964 1.1009 1.0888 1.0950 1.0976 1.0969 1.0989 1.0954 1.0881 1.0874 1.0959 1.0956 1.0653
irintensity: 0.1795 0.8748 0.1237 0.1049 0.3707 1.3211 3.6697 0.1527 1.0811 0.5809 0.1656 1.4310 0.7655 2.4246 8.3204 9.6944 133.2607 26.9553 7.4965 1.4214 1.5667 8.4924 11.2895 5.0219 0.3785 1.2932 2.9409 5.4051 0.1476 0.9381 34.3411 5.0233 3.7532 13.5008 0.6870 6.3948 2.6056 7.5364 1.5099 28.6093 70.3837 6.0367 5.4642 23.0950 10.9176 22.7942 0.5510 32.7275 10.0925 5.6770 9.0858 17.6284 13.8474 11.7503 4.5632 0.8499 14.2951 8.5753 12.5947 7.9451 3.4284 9.2590 6.5860 14.1971 1.5183 1.1190 1.1913 0.1646 6.9843 2.0482 17.6126 8.8550 2.6642 6.4511 14.1688 2.6373 12.3354 13.1640 17.2861 0.5352 1.9238 31.4286 0.3020 2.8303 39.1844 59.7592 152.3719 54.2789 40.0115 38.4557 38.7550 30.0832 72.8268 48.3237 16.8385 25.7151 20.6601 87.8223 19.1466 37.7993 11.2127 18.6312 24.5981 3.2103 9.8439
temp: 298.150 k
press: 1.00000 atm
elementType: 8 7 6 6 6 6 6 6 6 6 6 6 6 6 6 6 1 1 1 1 1 1 1 1 1 1 1 1 1 1 1 1 1 1 1 1 1
symmnumber: 1
zpe: 844254.9 jmol-1
zpe.correction: 0.321560 hartree
zpe.thermalcorrener: 0.337586 hartree
zpe.thermalcorrenthalpy: 0.338531 hartree
zpe.thermalcorrgfe: 0.277202 hartree
zpe.sumelectzpe: -674.812201 hartree
zpe.sumelectthermal: -674.796174 hartree
zpe.sumelectthermalent: -674.795230 hartree
zpe.sumelectthermalfe: -674.856559 hartree
dipole: -0.0345 -2.2973 0.0371
dipole: 2.2979
quadrupole: -85.1735 -108.3794 -95.0296
quadrupole: -4.3954 -0.1349 1.5397
quadrupole: 11.0207 -12.1852 1.1646 -4.3954 -0.1349 1.5397
hfenergy: -675.1337607 hartree
pointgroup: C01 [X(C14H21N1O1)]
dipole: 0.0130493 0.896035 0.1194668 debye
polarizability: 204.9110157|13.6571262|135.9599959|-3.5095685|12.4976875|134.7733772 unknown
InChI: InChI=1S/C14H21NO/c1-12-5-7-13(8-6-12)14(11-16)15-9-3-2-4-10-15/h5-8,14,16H,2-4,9-11H2,1H3
charge 0 multiplicity 1
37 atoms
O  0.555212 -3.202068 -0.400173
N  -1.624308 -0.090947 0.039171
C  -2.961376 -0.742653 0.103774
C  -1.705452 1.20156 -0.700127
C  -0.544653 -0.952695 -0.528682
C  -3.996806 0.17727 0.78531
C  -2.697766 2.176098 -0.037691
C  -4.100835 1.539222 0.066109
C  0.832596 -0.324405 -0.290301
C  -0.549287 -2.382545 0.100908
C  1.850166 -0.412166 -1.271275
C  1.144995 0.282032 0.954615
C  3.146806 0.096041 -1.016499
C  2.43612 0.788326 1.203468
C  3.463262 0.702881 0.223815
C  4.851604 1.252842 0.503479
H  -2.884146 -1.676907 0.685222
H  -3.328524 -1.012818 -0.922353
H  -2.019022 1.02446 -1.763525
H  -0.696898 1.649386 -0.728217
H  -0.679531 -1.092435 -1.633031
H  -3.686184 0.339399 1.836094
H  -4.978251 -0.334956 0.801979
H  -2.73362 3.114013 -0.624796
H  -2.328604 2.429598 0.975176
H  -4.513706 1.389206 -0.953137
H  -4.79838 2.210167 0.602302
H  -1.447582 -2.946747 -0.194122
H  -0.520301 -2.288872 1.207875
H  1.624202 -0.866088 -2.243777
H  0.350496 0.366058 1.704506
H  3.919096 0.020852 -1.791764
H  2.656285 1.258192 2.170647
H  1.405446 -2.714815 -0.240096
H  4.819876 2.339674 0.708189
H  5.304426 0.769744 1.389787
H  5.530542 1.091496 -0.351362
