program: Gaussian 09
title: 000202134
version: EM64L-G09RevD.01
frameworkgroup: C1[X(C11H18N2O4)]
method: RPBEPBE
basis: SDD
operation: Freq
keyword: #p
keyword: freq=noraman
keyword: PBEPBE/SDD
title: #p freq=noraman PBEPBE/SDD
converged: YES YES NO NO
title: Mulliken charges:
elementType: O O O O N N C C C C C C C C C C C H H H H H H H H H H H H H H H H H H
charge: -0.471076 -0.250124 -0.223322 -0.223513 -0.359750 -0.376521 0.133117 -0.551938 0.329972 -0.405066 -0.379249 0.154890 0.155210 -0.784283 -0.711271 -0.734717 0.152210 0.255420 0.226416 0.251643 0.216291 0.226754 0.210780 0.213578 0.221113 0.252776 0.227299 0.262450 0.218871 0.357350 0.248021 0.215590 0.212287 0.364593 0.364198
chargesum: 0.00000
title: Mulliken charges with hydrogens summed into heavy atoms:
elementType: O O O O N N C C C C C C C C C C C
charge: -0.113726 -0.250124 -0.223322 -0.223513 0.004843 -0.012323 0.133117 -0.070102 0.329972 0.062869 0.058285 0.154890 0.155210 -0.096816 -0.002650 -0.058819 0.152210
polarizability: 1.46372009e+02 1.58739995e+01 1.49641451e+02 1.47825392e-01 1.34179226e+00 1.35577209e+02
1716.lowfreq: -12.0195 -10.0897 -0.0008 -0.0006 0.0004 6.5163 23.4480 41.3069 74.7010
frequency: 23.3520 41.1481 74.6825 81.9009 117.0104 142.4145 146.6750 166.5671 176.7909 196.6757 201.6167 207.9864 232.5393 244.2225 266.8218 298.8284 305.6457 351.5212 355.8121 362.9171 385.1148 398.8234 431.8604 472.7584 489.3722 495.9923 576.1267 594.3072 628.8152 650.8053 671.2709 696.4445 719.5947 754.6587 756.3426 767.2147 778.5542 789.5050 829.6333 886.7295 903.5339 933.6244 982.0621 992.6788 1003.1015 1007.9156 1027.6415 1053.1597 1067.2607 1096.9245 1125.6748 1148.7783 1158.4975 1173.4376 1199.8041 1246.0303 1285.6147 1303.2347 1310.2254 1326.5913 1331.5222 1349.5372 1365.8107 1371.5321 1374.8541 1377.6645 1383.4470 1390.0269 1398.3099 1442.2898 1444.9539 1467.9860 1468.5822 1471.3884 1474.4960 1486.7709 1491.2477 1493.2110 1601.9342 1639.4736 1677.8853 2978.8255 2979.1963 2985.8324 2993.5882 3000.5015 3002.7211 3042.8715 3053.5625 3065.6783 3076.6592 3077.8804 3082.7483 3094.4309 3101.8305 3103.7096 3517.5096 3523.9478 3528.3050
redmass: 3.7434 6.9248 2.6147 2.6042 2.6689 3.0875 3.8952 7.3058 7.1195 1.4647 1.6523 2.7988 1.8373 1.9120 2.0021 3.6892 1.7561 2.8733 4.7095 3.6864 4.8655 2.7451 2.8742 1.4003 3.6344 4.1754 3.2221 8.2280 3.9421 2.7852 2.3796 5.2373 3.7040 2.5076 2.0089 1.3877 1.3918 1.7604 2.3957 2.1930 2.0462 3.0621 1.5353 3.4039 2.0152 1.4950 1.8855 3.1086 2.8145 1.7874 2.0774 2.3621 2.2920 2.8635 2.3381 1.4759 1.2387 1.6132 1.9695 1.4883 1.5756 1.4681 2.3802 3.0921 1.5371 2.2149 1.2333 1.2140 1.2072 1.0830 1.0817 1.0787 1.0652 1.0551 1.0471 1.0465 1.0522 1.0593 6.2935 8.0219 5.5071 1.0597 1.0383 1.0358 1.0370 1.0611 1.0612 1.1008 1.0999 1.0988 1.0994 1.0991 1.0983 1.1007 1.0982 1.1004 1.0766 1.0772 1.0659
irintensity: 0.6421 3.1050 0.1384 0.1572 0.2537 2.3847 0.5057 9.6256 16.5131 0.1027 1.0396 2.6686 3.2650 6.1454 2.6317 6.8544 3.6290 2.5676 17.5138 27.2886 2.6909 3.9986 4.6313 154.0047 67.4461 47.0957 12.1218 4.8160 2.2777 3.1991 12.5856 11.1625 1.3516 6.1824 6.0102 7.8747 17.3716 228.1862 6.1179 24.8764 0.3563 9.4210 14.6690 2.4177 7.5717 18.6156 8.0798 12.7272 5.2018 3.4723 34.6430 1.5887 14.2505 24.0966 58.1366 13.6277 9.4695 98.0633 130.1070 40.3756 37.0821 29.1802 107.8542 112.5725 29.7937 32.4896 14.4940 20.3434 22.4890 10.6942 10.6882 11.4615 5.2493 15.9794 13.9019 13.0578 10.9828 1.0356 286.2032 80.9264 617.5503 24.1272 16.4699 40.8519 23.4927 18.1473 16.7712 5.8709 4.8524 21.8909 36.5025 17.8561 34.7249 39.3144 21.2504 19.3650 67.2171 60.7819 8.9247
temp: 298.150 k
press: 1.00000 atm
elementType: 8 8 8 8 7 7 6 6 6 6 6 6 6 6 6 6 6 1 1 1 1 1 1 1 1 1 1 1 1 1 1 1 1 1 1
symmnumber: 1
zpe: 752616.0 jmol-1
zpe.correction: 0.286656 hartree
zpe.thermalcorrener: 0.304849 hartree
zpe.thermalcorrenthalpy: 0.305793 hartree
zpe.thermalcorrgfe: 0.240970 hartree
zpe.sumelectzpe: -839.093841 hartree
zpe.sumelectthermal: -839.075649 hartree
zpe.sumelectthermalent: -839.074704 hartree
zpe.sumelectthermalfe: -839.139528 hartree
dipole: 0.9916 2.5398 0.2938
dipole: 2.7423
quadrupole: -100.8054 -107.3757 -108.4988
quadrupole: -4.2399 0.7563 1.0578
quadrupole: 4.7545 -1.8157 -2.9388 -4.2399 0.7563 1.0578
hfenergy: -839.3804977 hartree
pointgroup: C01 [X(C11H18N2O4)]
dipole: -0.4978097 0.9539315 -0.0789622 debye
polarizability: 149.3918536|-15.9575786|146.5037283|-1.0310297|0.3748622|135.6950869 unknown
InChI: InChI=1S/C11H18N2O4/c1-4-10(3,17)6-11(5-2)7(14)12-9(16)13-8(11)15/h12-13,17H,4-6H2,1-3H3
charge 0 multiplicity 1
35 atoms
O  -1.549813 -1.197702 -0.992801
O  0.274258 0.33715 -2.626573
O  0.701969 0.79338 2.210175
O  3.111028 -2.389349 -0.160745
N  1.701136 -0.965732 -1.364807
N  1.899753 -0.745683 0.977295
C  0.42065 0.884148 -0.232548
C  -1.116738 1.119734 -0.140754
C  -2.038389 -0.143379 -0.060482
C  1.160009 2.272732 -0.49666
C  -2.004699 -0.828514 1.330584
C  0.743419 0.051418 -1.488661
C  0.981074 0.316925 1.077806
C  -3.466717 0.281922 -0.470929
C  0.86797 3.402906 0.508455
C  -3.016652 -1.97983 1.505393
C  2.293692 -1.436336 -0.182837
H  -1.316356 1.751807 0.741994
H  -1.392012 1.700046 -1.042652
H  0.859089 2.583765 -1.514844
H  2.251333 2.079699 -0.529887
H  -0.9893 -1.236154 1.484294
H  -2.154829 -0.058361 2.110553
H  -3.4613 0.752383 -1.472812
H  -3.88494 1.014641 0.243611
H  -4.138035 -0.591274 -0.505854
H  -0.184866 3.73079 0.461824
H  1.085456 3.100067 1.545937
H  1.498579 4.276543 0.261064
H  -1.620534 -0.863969 -1.925638
H  -2.921729 -2.705172 0.678696
H  -2.825706 -2.513873 2.454052
H  -4.060165 -1.618058 1.535601
H  1.947845 -1.476606 -2.218552
H  2.310819 -1.084061 1.853802
