program: Gaussian 09
title: 000202137
version: EM64L-G09RevD.01
frameworkgroup: C1[X(C15H21NO3)]
method: RPBEPBE
basis: SDD
operation: Freq
keyword: #p
keyword: freq=noraman
keyword: PBEPBE/SDD
title: #p freq=noraman PBEPBE/SDD
converged: YES YES NO NO
title: Mulliken charges:
elementType: O O O N C C C C C C C C C C C C C C C H H H H H H H H H H H H H H H H H H H H H
charge: -0.245644 -0.260639 -0.223584 -0.134478 -0.248874 -0.342370 -0.338543 -0.330465 -0.331911 0.421540 0.178525 -0.431173 -0.353262 -0.414556 -0.360723 0.433913 -0.260579 -0.808055 -0.664501 0.232325 0.193892 0.236614 0.231049 0.189700 0.195301 0.213733 0.212880 0.199115 0.236085 0.276424 0.229007 0.229135 0.224878 0.235969 0.233833 0.223756 0.228869 0.218605 0.246971 0.227239
chargesum: 0.00000
title: Mulliken charges with hydrogens summed into heavy atoms:
elementType: O O O N C C C C C C C C C C C C C C C
charge: -0.245644 -0.260639 -0.223584 -0.134478 -0.016549 0.088135 0.082206 0.078568 0.080084 0.421540 0.178525 -0.195088 -0.076838 -0.185549 -0.131588 0.433913 0.200268 -0.121597 0.028314
polarizability: 2.19212495e+02 1.10656362e+01 1.63327000e+02 1.77564661e+00 -1.02448635e+01 1.49615789e+02
1716.lowfreq: -12.0114 -4.2600 -0.3990 -0.0008 -0.0007 0.0004 19.2771 29.9201 38.2616
frequency: 18.7726 29.6994 38.1631 41.1097 51.3689 55.3300 73.6380 92.5240 137.5302 155.0104 164.7621 202.4621 230.9215 243.5428 260.8676 298.2470 307.9077 321.4188 337.2871 360.6690 396.6039 408.1452 428.8487 463.3586 467.9734 509.9068 546.2108 615.3926 635.3684 660.5821 689.9014 728.8892 770.5908 777.1770 803.1538 808.2095 827.5552 840.2259 844.0928 849.1147 856.2612 894.1500 936.3641 959.3562 982.6504 986.4440 1000.9590 1015.2011 1019.3254 1027.2259 1047.5185 1052.9690 1082.9957 1093.0356 1098.9936 1105.7368 1117.7326 1130.6750 1155.2520 1157.9361 1184.1142 1193.7498 1201.8996 1220.4296 1246.3775 1267.5400 1273.4232 1277.2248 1295.2449 1313.4510 1322.0069 1336.7888 1347.3348 1354.6996 1371.5903 1376.3670 1388.2234 1389.5010 1397.3451 1408.1697 1443.1311 1449.0310 1451.8309 1455.8568 1461.6661 1462.5915 1470.2635 1475.6343 1484.1246 1503.6420 1586.8061 1621.1126 1641.8971 2862.9706 2869.8262 2884.6443 2955.5555 2961.8478 2976.3495 2992.9123 3028.7730 3050.6819 3053.0807 3055.0253 3080.2477 3083.5381 3084.3600 3088.3325 3092.6275 3116.1206 3118.8512 3119.6818 3139.4607 3155.5362
redmass: 3.5985 3.1657 2.2191 1.3263 3.4640 3.2404 3.7830 5.2249 5.0923 4.1147 3.2266 1.4865 2.1235 4.0064 2.6149 2.6301 3.5020 3.6199 4.2327 3.1493 1.9269 2.8517 3.4468 3.2433 4.2886 3.0488 3.8414 2.2850 5.5728 5.7874 4.0692 3.1553 3.6432 3.5629 1.7435 2.3461 1.8861 3.4713 1.6434 3.0045 1.3626 2.9903 2.5140 1.4496 1.3828 1.4278 2.6043 2.8744 2.9139 2.1924 1.5587 2.0494 3.8384 2.6745 2.4948 2.4783 1.5604 2.0942 1.7577 3.8110 1.2963 1.1113 1.8832 3.0204 1.3269 1.3192 1.4714 1.1182 1.2203 1.3374 1.3388 1.2458 1.2956 1.3003 1.2999 2.5582 1.8522 1.2383 1.2873 2.5864 1.0817 1.0808 1.0959 1.0935 1.1032 1.0434 1.0503 1.0995 1.0511 2.6626 6.1242 6.3645 9.0354 1.0708 1.0722 1.0785 1.0666 1.0662 1.0374 1.0359 1.0594 1.0880 1.0899 1.0971 1.0962 1.0980 1.0990 1.0975 1.1031 1.0873 1.1061 1.0891 1.0966 1.0953
irintensity: 0.8837 0.1616 0.4577 0.3911 0.0623 0.1374 0.7524 0.2738 2.8254 2.6068 6.1143 1.1492 2.1815 0.5881 3.6952 3.6816 1.1421 7.2336 14.3103 2.5716 0.5731 0.1349 1.5993 3.7969 2.4819 20.1584 11.9185 2.0853 2.2485 3.7756 9.7983 6.3004 6.0496 7.8932 3.1506 20.7636 29.1561 38.5031 1.1411 1.8784 2.4805 1.3773 18.3274 4.7879 1.9691 5.2897 18.4112 4.0492 89.0464 9.3738 11.7363 27.5897 20.2364 231.5790 87.2823 72.0321 15.7541 26.3670 7.5394 39.1997 8.7489 1.6082 0.6316 0.6886 64.6176 10.5947 6.1618 4.8379 5.4596 23.9432 5.5946 0.4701 11.0409 3.2548 2.3839 1.3086 7.7392 26.8153 8.4303 4.3134 2.3672 1.8443 17.6498 9.6865 3.0955 15.4536 13.0311 13.4742 12.6092 31.0265 0.7087 6.6426 120.1871 41.9604 69.3659 94.3213 44.2334 80.4764 38.3219 20.8053 27.1195 30.7050 16.8935 21.3697 39.6382 36.3707 19.6575 35.2932 1.0206 11.2728 32.3753 20.6888 21.9493 2.0600
temp: 298.150 k
press: 1.00000 atm
elementType: 8 8 8 7 6 6 6 6 6 6 6 6 6 6 6 6 6 6 6 1 1 1 1 1 1 1 1 1 1 1 1 1 1 1 1 1 1 1 1 1
symmnumber: 1
zpe: 877202.5 jmol-1
zpe.correction: 0.334109 hartree
zpe.thermalcorrener: 0.353543 hartree
zpe.thermalcorrenthalpy: 0.354488 hartree
zpe.thermalcorrgfe: 0.283269 hartree
zpe.sumelectzpe: -863.143142 hartree
zpe.sumelectthermal: -863.123707 hartree
zpe.sumelectthermalent: -863.122763 hartree
zpe.sumelectthermalfe: -863.193981 hartree
dipole: -1.8411 2.2133 -1.1838
dipole: 3.1129
quadrupole: -106.3325 -109.2658 -114.0396
quadrupole: 11.9239 -0.3022 -3.8656
quadrupole: 3.5468 0.6135 -4.1603 11.9239 -0.3022 -3.8656
hfenergy: -863.4772503 hartree
pointgroup: C01 [X(C15H21N1O3)]
dipole: 0.6067159 0.9630279 0.4520376 debye
polarizability: 221.1572474|-2.7290819|161.369012|-1.2527961|10.451369|149.6290245 unknown
InChI: InChI=1S/C15H21NO3/c1-3-19-15(17)14(16-8-10-18-11-9-16)13-6-4-12(2)5-7-13/h4-7,14H,3,8-11H2,1-2H3
charge 0 multiplicity 1
40 atoms
O  -2.646366 -3.614835 0.281977
O  -1.191615 2.412116 0.722732
O  -1.390649 1.415233 -1.37921
N  -1.129246 -1.13613 0.09053
C  -0.501537 0.121355 0.569523
C  -0.578434 -2.330519 0.78783
C  -2.614172 -1.129119 0.19561
C  -1.177309 -3.609733 0.183677
C  -3.181202 -2.426268 -0.402825
C  1.012166 0.134864 0.319588
C  -1.089522 1.340956 -0.168226
C  1.911766 0.515611 1.340071
C  1.523608 -0.205161 -0.958481
C  3.303397 0.550409 1.091874
C  2.911361 -0.172024 -1.19887
C  3.827004 0.20855 -0.180005
C  -1.644584 3.71871 0.147891
C  5.320002 0.256819 -0.45653
C  -3.172875 3.810017 0.156985
H  -0.68124 0.295039 1.658698
H  -0.806083 -2.300819 1.883561
H  0.519038 -2.347374 0.66732
H  -3.015624 -0.271715 -0.372859
H  -2.947475 -1.038779 1.260256
H  -0.873118 -3.692952 -0.882131
H  -0.840848 -4.502434 0.736538
H  -4.274876 -2.476966 -0.272405
H  -2.929568 -2.470988 -1.484122
H  1.526102 0.785848 2.330657
H  0.820054 -0.497362 -1.745436
H  3.989701 0.843661 1.895503
H  3.294902 -0.439953 -2.19145
H  -1.179208 4.466794 0.809271
H  -1.2416 3.809135 -0.876147
H  5.567126 1.063456 -1.173071
H  5.8972 0.441018 0.46586
H  5.679629 -0.690494 -0.899256
H  -3.489058 4.812652 -0.186032
H  -3.612903 3.060001 -0.521332
H  -3.570941 3.652184 1.174232
