program: Gaussian 09
title: 000202129
version: EM64L-G09RevD.01
frameworkgroup: C1[X(C17H28O3S2)]
method: RPBEPBE
basis: SDD
operation: Freq
keyword: #p
keyword: freq=noraman
keyword: PBEPBE/SDD
title: #p freq=noraman PBEPBE/SDD
converged: YES YES NO NO
title: Mulliken charges:
elementType: S S O O O C C C C C C C C C C C C C C C C C H H H H H H H H H H H H H H H H H H H H H H H H H H H H
charge: 0.160210 0.993257 -0.569209 -0.504637 -0.504830 -0.375986 -0.367589 -0.370963 -0.344315 -0.352701 -0.671377 -0.356364 -0.348255 -0.655310 -0.555286 0.519235 -0.695661 -0.388106 -0.382600 -0.058721 -0.234570 -0.237380 0.193256 0.193268 0.191364 0.190605 0.189161 0.188878 0.213547 0.213040 0.188607 0.188461 0.249867 0.247915 0.194689 0.194855 0.229287 0.231335 0.248121 0.247097 0.213074 0.212457 0.210085 0.210011 0.215623 0.249693 0.249887 0.282292 0.282538 0.382147
chargesum: 0.00000
title: Mulliken charges with hydrogens summed into heavy atoms:
elementType: S S O O O C C C C C C C C C C C C C C C C C
charge: 0.160210 0.993257 -0.187062 -0.504637 -0.504830 0.010538 0.014379 0.007077 0.082272 0.024367 -0.173595 0.033180 0.112366 -0.160091 -0.129755 0.519235 -0.059941 -0.138413 -0.132714 -0.058721 0.047722 0.045157
polarizability: 3.65101359e+02 -1.90029613e+01 1.83889513e+02 -1.73385577e+00 -3.02681964e+00 1.95666951e+02
1716.lowfreq: -3.0513 -0.0018 -0.0017 0.0011 2.0807 7.5543 10.1311 13.8331 19.7364
frequency: 8.8083 13.3178 19.4860 33.8468 34.4557 38.8198 42.2917 63.8132 69.8957 82.6578 85.2307 88.0723 99.3387 113.1491 132.8827 135.2499 140.9895 150.9902 157.7511 172.9009 200.5918 210.3132 232.5083 259.5473 269.7872 286.5642 305.1787 319.7166 333.7828 358.4529 386.8659 395.1404 407.2989 432.2050 443.2914 474.1786 515.8112 565.1770 612.8944 620.2971 702.6516 720.7452 722.7554 730.1557 733.8229 749.0277 756.7643 786.6716 805.6957 835.5225 835.8966 849.3389 852.6504 853.2321 888.8648 926.4181 966.1394 968.4759 985.8985 986.4295 993.2567 998.5238 1014.7994 1016.8101 1018.8079 1039.3761 1047.4495 1056.7885 1059.1438 1065.5773 1070.7980 1076.3732 1080.2438 1090.8480 1119.7473 1129.6927 1184.8779 1185.3119 1205.7657 1214.1846 1219.4825 1227.7027 1248.6454 1251.1134 1256.6535 1278.8626 1281.2304 1282.3661 1285.1352 1294.2059 1297.8629 1298.5753 1302.1565 1318.8930 1338.7838 1345.3082 1354.7235 1355.7534 1389.4724 1390.9567 1401.5568 1451.1595 1458.3301 1462.6888 1463.4059 1467.1081 1469.0548 1471.8516 1474.7379 1477.8481 1478.8385 1485.3431 1488.7455 1489.2192 1592.8428 1594.7055 2950.8488 2953.1976 2955.7046 2962.5405 2968.4622 2972.2538 2979.5418 2983.3388 2985.5198 2989.2514 2993.6239 2996.3395 2998.1999 3004.5253 3020.5252 3030.5865 3033.6069 3043.4833 3049.6079 3068.7257 3070.9550 3071.2682 3074.3102 3137.4559 3139.1025 3165.2443 3167.9445 3481.6385
redmass: 6.0648 5.7284 5.6201 3.4847 4.7447 3.8597 2.2038 2.0491 4.6862 4.5373 3.0039 1.9419 2.5346 2.0135 5.9820 4.6050 2.0880 2.0053 5.0176 1.4842 4.8362 7.3167 1.1204 4.5452 2.8108 6.2251 4.2763 3.9608 6.3665 4.2286 4.0176 5.4520 2.8642 7.3537 3.4105 3.1004 4.5844 5.4276 5.8864 6.8989 5.8013 6.4978 1.0624 1.0790 3.7337 1.1040 1.0931 1.1652 3.4511 2.8062 1.9245 1.2406 1.3827 1.4920 1.8866 1.2176 14.9989 1.3949 1.3878 4.8759 5.3549 1.1632 4.3022 1.4152 3.6939 3.3134 1.4621 3.1029 1.7639 1.1088 2.9371 2.3831 2.1690 1.1983 2.5836 1.1896 1.1317 1.7941 1.2227 2.5229 1.4570 1.2672 1.3035 1.2880 1.2899 1.3003 1.0396 1.1467 1.1191 1.0792 1.1187 1.3407 1.2392 1.3541 1.4185 1.4513 1.5933 1.6748 7.3326 1.2179 2.7309 1.0876 1.0891 1.0731 1.0728 1.0694 1.7839 1.0793 1.2693 1.0424 1.0797 1.0876 1.1012 1.0940 6.0857 7.4234 1.0589 1.0588 1.0591 1.0591 1.0588 1.0365 1.0591 1.0591 1.0969 1.0576 1.0991 1.0558 1.0574 1.1019 1.1038 1.1012 1.1044 1.1050 1.1058 1.1007 1.0993 1.1078 1.1084 1.0894 1.0896 1.0955 1.0968 1.0661
irintensity: 0.0560 0.2086 0.1290 0.1878 0.0459 1.9129 0.7991 0.5476 0.2365 0.1196 0.0724 0.0460 0.9275 0.0986 0.7993 0.7080 0.1663 0.0017 1.8544 53.5178 2.2067 5.3027 0.0004 7.6451 54.7346 5.3649 7.9222 21.0607 3.4410 8.0543 1.4931 3.7532 0.1515 64.6328 9.2525 0.0168 15.3320 192.8871 31.6851 0.0309 5.6079 2.9147 14.0100 0.6753 0.1974 3.0263 8.9968 0.1108 27.1143 40.4988 26.3765 0.1604 18.3252 24.6426 5.7298 0.0402 93.6430 0.5838 0.3651 0.1243 2.2121 0.1997 5.9695 1.4587 0.2719 0.0021 35.8423 3.0188 68.9421 0.0794 2.3645 0.0667 0.4927 1.5093 18.4014 4.2564 5.8519 0.1635 3.3294 6.9657 0.0212 3.8394 5.5232 7.9342 0.0444 26.1422 0.1880 0.2360 1.0311 0.1588 0.1270 22.1838 1.0072 3.9176 3.2481 2.9984 0.1885 0.3295 5.8677 11.4533 11.1468 9.0315 0.8097 0.0126 0.3142 1.2526 13.5807 1.2401 9.5472 12.3747 1.4120 1.8997 8.9124 30.8658 26.4231 0.6629 0.0279 2.3553 0.0119 17.5009 136.4654 38.5003 34.0177 8.5351 0.1675 5.7731 0.3474 93.7713 23.1984 0.7963 0.0098 2.5391 22.2404 108.3203 0.0462 79.6130 54.9721 139.1097 0.9371 10.7354 5.6452 0.0433 8.3933 43.6927
temp: 298.150 k
press: 1.00000 atm
elementType: 16 16 8 8 8 6 6 6 6 6 6 6 6 6 6 6 6 6 6 6 6 6 1 1 1 1 1 1 1 1 1 1 1 1 1 1 1 1 1 1 1 1 1 1 1 1 1 1 1 1
symmnumber: 1
zpe: 1092383.2 jmol-1
zpe.correction: 0.416067 hartree
zpe.thermalcorrener: 0.443579 hartree
zpe.thermalcorrenthalpy: 0.444523 hartree
zpe.thermalcorrgfe: 0.351388 hartree
zpe.sumelectzpe: -1684.488778 hartree
zpe.sumelectthermal: -1684.461266 hartree
zpe.sumelectthermalent: -1684.460322 hartree
zpe.sumelectthermalfe: -1684.553456 hartree
dipole: 5.0375 -4.6064 -0.3115
dipole: 6.8331
quadrupole: -178.3573 -159.1585 -148.6615
quadrupole: 16.8629 2.1425 -0.9829
quadrupole: -16.2982 2.9006 13.3976 16.8629 2.1425 -0.9829
hfenergy: -1684.9048444 hartree
pointgroup: C01 [X(C17H28O3S2)]
dipole: 1.966715 1.812981 0.2691681 debye
polarizability: 364.7558188|20.1550072|184.6623291|4.5812265|-3.6423881|195.2396743 unknown
InChI: InChI=1S/C17H28O3S2/c1-2-3-4-5-6-7-14-21-15-8-9-16-10-12-17(13-11-16)22(18,19)20/h10-13,18H,2-9,14-15H2,1H3
charge 0 multiplicity 1
50 atoms
S  1.682105 -0.443649 -0.025306
S  -7.737087 -0.923939 -0.241727
O  -8.685874 0.651075 0.043216
O  -8.014119 -1.416746 -1.758128
O  -8.010061 -1.916131 1.007491
C  7.071491 -0.509632 -0.01426
C  5.836899 0.420068 0.013369
C  8.412828 0.257929 0.000255
C  4.499625 -0.358848 -0.010169
C  9.648166 -0.670361 -0.020149
C  3.280476 0.577705 0.034252
C  10.990328 0.096765 -0.00798
C  -0.99809 0.399696 0.032866
C  0.427854 0.968195 0.124418
C  -2.074522 1.514055 0.195234
C  -3.483951 0.955353 0.094592
C  12.218837 -0.83836 -0.025993
C  -4.147635 0.890519 -1.159205
C  -4.139372 0.440773 1.244779
C  -6.03821 -0.157169 -0.104758
C  -5.439116 0.333354 -1.275289
C  -5.43077 -0.121652 1.160102
H  7.026685 -1.151869 -0.918441
H  7.032667 -1.196198 0.856976
H  5.878308 1.109852 -0.85527
H  5.87854 1.056682 0.921784
H  8.453856 0.941252 -0.873916
H  8.455801 0.904435 0.901957
H  4.461255 -1.054111 0.851789
H  4.453016 -0.982705 -0.925018
H  9.606565 -1.318614 -0.920564
H  9.609985 -1.352685 0.85486
H  3.278131 1.266688 -0.830056
H  3.271316 1.170704 0.967093
H  11.030318 0.745398 0.891088
H  11.028356 0.7772 -0.883281
H  -1.144939 -0.368888 0.816227
H  -1.135878 -0.107926 -0.940945
H  0.591451 1.474711 1.093518
H  0.620423 1.687977 -0.692371
H  -1.929691 2.00848 1.175213
H  -1.913732 2.283392 -0.584426
H  12.218077 -1.475819 -0.930427
H  12.219381 -1.508144 0.854751
H  13.165104 -0.26665 -0.016364
H  -3.652245 1.283892 -2.054166
H  -3.63777 0.484976 2.218225
H  -5.957007 0.270376 -2.23728
H  -5.942914 -0.528345 2.037573
H  -9.66046 0.423138 0.005364
