program: Gaussian 09
title: 000202108
version: EM64L-G09RevD.01
frameworkgroup: C1[X(C11H9N3O2S)]
method: RPBEPBE
basis: SDD
operation: Freq
keyword: #p
keyword: freq=noraman
keyword: PBEPBE/SDD
title: #p freq=noraman PBEPBE/SDD
converged: NO YES NO NO
title: Mulliken charges:
elementType: S O O N N N C C C C C C C C C C C H H H H H H H H H
charge: 0.315055 -0.212008 -0.212705 -0.292451 -0.026742 0.023783 -0.359627 0.543367 -0.487898 -0.185177 0.362492 -0.738430 -0.362520 -0.329882 -0.365139 -0.379289 0.382744 0.249007 0.230651 0.238152 0.241401 0.285098 0.258888 0.243229 0.288969 0.289031
chargesum: 0.00000
title: Mulliken charges with hydrogens summed into heavy atoms:
elementType: S O O N N N C C C C C C C C C C C
charge: 0.315055 -0.212008 -0.212705 -0.292451 -0.026742 0.023783 0.120031 0.543367 -0.008346 -0.185177 0.362492 -0.453332 -0.103631 -0.086654 -0.076170 -0.090257 0.382744
polarizability: 3.63939631e+02 -1.14474898e+01 1.71228701e+02 -4.39992802e+00 -1.00700491e+01 8.27843988e+01
1716.lowfreq: -7.7809 -3.5683 -0.0003 0.0012 0.0018 6.9482 37.7381 45.6446 63.9710
frequency: 37.5020 45.6249 63.9700 82.3029 100.6535 139.9113 175.8377 194.8136 215.6120 229.7950 301.2321 328.7439 412.1193 415.0047 460.0771 474.8871 495.2110 508.1827 563.7533 601.4802 616.0576 640.5594 664.0312 666.8670 691.7728 732.9588 748.6298 765.9602 789.6065 820.6325 847.2834 865.9262 880.7506 921.9632 942.4978 986.3535 992.1567 995.1972 1004.2905 1066.1171 1095.3611 1110.7005 1158.7951 1162.3473 1172.8725 1181.5543 1209.4553 1219.0650 1224.0852 1292.8684 1295.8392 1316.6988 1353.0237 1383.3798 1401.6318 1422.3878 1467.2330 1478.1712 1491.1948 1547.4344 1584.1830 1589.6560 1610.0393 2995.9870 3012.5896 3061.9618 3082.6807 3154.9434 3162.4433 3184.2799 3187.1245 3251.2598
redmass: 5.9525 7.0483 4.8436 4.3666 2.9473 6.2271 5.4258 4.8774 7.6282 8.9634 6.4077 5.8208 5.4388 3.6204 7.9955 4.3415 9.8610 7.4712 4.5011 5.6761 6.0243 4.0935 4.4060 7.8295 1.6187 5.3592 4.3237 4.9386 7.7761 1.4391 1.2662 1.7120 5.9138 3.8055 5.7285 1.5291 3.1407 1.4000 2.6772 1.6242 3.2220 1.3170 3.0421 1.6704 1.2435 1.5374 1.2206 3.9326 2.4374 1.2798 1.2797 1.4942 6.1306 7.9474 6.0511 4.0954 1.1761 2.0618 1.2342 7.0814 7.9665 8.2097 6.4116 1.0612 1.0641 1.1014 1.1058 1.0899 1.0887 1.0951 1.0965 1.0961
irintensity: 1.1765 4.2285 2.3795 1.6570 0.8089 0.3223 4.8618 4.6838 5.5231 2.0017 5.3363 0.2918 0.0241 2.6684 5.1513 12.3388 17.2931 1.2228 5.5503 3.9167 0.9832 1.5167 10.2357 10.6798 71.4688 23.3169 3.7570 64.6060 2.7312 0.4371 4.0093 51.3532 3.2473 3.2275 11.5000 2.7962 4.6714 0.4601 1.2298 0.0579 19.3729 14.0044 38.7994 14.5210 15.6994 317.0563 23.2420 565.3276 47.7301 54.1937 0.1984 10.3030 86.7067 28.8208 58.5201 48.3074 0.6181 46.6253 5.2240 72.6704 99.8983 441.6547 121.5740 25.4174 65.6703 9.6508 35.0137 3.8495 4.8989 0.0790 4.3883 8.7920
temp: 298.150 k
press: 1.00000 atm
elementType: 16 8 8 7 7 7 6 6 6 6 6 6 6 6 6 6 6 1 1 1 1 1 1 1 1 1
symmnumber: 1
zpe: 486566.5 jmol-1
zpe.correction: 0.185323 hartree
zpe.thermalcorrener: 0.199558 hartree
zpe.thermalcorrenthalpy: 0.200502 hartree
zpe.thermalcorrgfe: 0.142445 hartree
zpe.sumelectzpe: -1136.017859 hartree
zpe.sumelectthermal: -1136.003624 hartree
zpe.sumelectthermalent: -1136.002680 hartree
zpe.sumelectthermalfe: -1136.060737 hartree
dipole: 2.5068 0.5590 0.2755
dipole: 2.5831
quadrupole: -161.2574 -92.2891 -105.0790
quadrupole: 5.9002 0.4536 -0.1409
quadrupole: -41.7156 27.2528 14.4628 5.9002 0.4536 -0.1409
hfenergy: -1136.203182 hartree
pointgroup: C01 [X(C11H9N3O2S1)]
dipole: 0.9919324 0.2211309 0.0030235 debye
dipolederiv: -0.5865409 0.1392658 -0.0607724 -0.4207849 -0.2396527 0.1026662 0.0966826 0.1098944 0.0732189 -1.1282367 -0.0336081 0.1623835 -0.3047809 -0.3084468 0.1541205 0.5931841 0.1260542 -0.5003395 -0.8952639 0.1531961 -0.1587384 0.447534 -0.415577 0.2404855 -0.6156001 0.2630994 -0.5859376 -1.1005203 -0.6375021 0.1774195 -0.1226915 -0.6354015 0.1616739 -0.0193356 0.2226341 -0.2438856 -0.9541098 -0.466449 0.1673468 -0.5903942 -0.7993868 0.1420166 0.1575336 0.1037755 -0.3619374 2.7571184 -0.2483138 0.0554878 -0.2715081 0.4708076 -0.4117697 0.0884267 -0.4113588 0.8258876 -0.0621339 -0.0329111 0.0116499 -0.0500592 0.3791877 0.024528 0.0127355 0.0148948 0.288045 -0.3571991 0.5260473 -0.1771769 1.2805276 0.3908685 -0.1102675 -0.3818259 -0.2153869 0.1797037 0.0939887 -0.0043896 -0.0178213 0.1370595 0.3940743 -0.0507551 -0.0842277 -0.0670881 0.2886439 1.1905855 0.6799725 -0.1816001 0.6395157 0.8583473 -0.2628216 -0.1359963 -0.2240129 0.0990674 1.0113421 -0.2116056 0.0723588 -0.3609236 0.0608294 -0.0553875 -0.0129654 -0.0074164 0.0896594 1.0700363 -0.2172174 0.0657133 -0.3987673 -0.2897494 -0.0087076 0.2380936 0.0507744 -0.3547593 -0.5924372 0.0240176 0.0767481 -0.1753141 -0.0557606 -0.1065153 0.1867023 -0.0912948 0.0148556 -0.4643332 0.1204546 -0.1575533 0.3198187 -0.1691746 -0.0232116 -0.3156865 -0.0140662 -0.0464579 0.4488235 -0.0212137 -0.0592183 -0.2476417 -0.0436531 -0.0421878 0.2742931 -0.0654955 -0.019707 0.5041283 -0.120401 0.1112124 0.075388 -0.0835883 -0.0424599 -0.1817166 -0.020341 -0.0389382 -1.4158541 0.1751676 -0.0840059 0.224715 0.0112207 0.0281667 -0.0935443 0.0280099 0.0195332 0.0291224 0.0871867 0.0587017 0.027183 -0.0290058 -0.0310377 0.0731358 -0.0979672 -0.0449893 0.0264024 0.0783145 -0.1121177 0.0219619 0.0331384 0.0068171 -0.0954839 0.0442056 -0.0522465 0.1014354 0.0414701 0.0189809 -0.0623991 0.0215374 0.0466877 0.1216311 0.1270751 -0.1287159 0.0807821 -0.0127401 -0.0259449 -0.1284347 -0.1168064 -0.0453356 -0.0345655 -0.1046704 0.0419639 0.0059789 -0.0473139 0.0250234 -0.0460746 0.0928013 0.0387646 0.0676058 0.0156047 0.2169914 0.046411 0.0517936 -0.0682978 0.016754 0.0927299 0.0782782 -0.0281765 0.0567245 0.0291959 0.0314044 -0.0278716 0.0860061 -0.0107763 0.1004277 0.0703097 0.0865465 0.0630676 0.0319999 0.0733992 -0.0238288 0.0535813 0.0149898 0.1428674 0.041271 0.0134533 0.0415673 0.0945324 0.0856704 0.0284794 -0.0393664 -0.014897 0.1373652 0.054671 -0.0108999 0.0517167 0.0846159 unknown
polarizability: 363.1062994|-16.5581141|140.980057|5.7915628|-43.7359196|113.8663747 unknown
InChI: InChI=1S/C11H9N3O2S/c15-14(16)9-3-1-8(2-4-9)10-7-17-11-12-5-6-13(10)11/h1-4,7H,5-6H2
charge 0 multiplicity 1
26 atoms
S  3.692666 -1.814936 0.729831
O  -5.137506 -0.31648 0.833783
O  -4.836675 0.887559 -1.083829
N  2.285739 0.276762 -0.124389
N  4.573506 0.767409 -0.119128
N  -4.387124 0.200576 -0.084089
C  2.286195 1.732682 -0.423834
C  1.310804 -0.639058 0.313163
C  3.840444 2.005054 -0.583399
C  3.63462 -0.111911 0.091008
C  -0.140177 -0.398565 0.204262
C  1.872372 -1.806085 0.797584
C  -1.018761 -0.929396 1.193536
C  -0.698643 0.336181 -0.881709
C  -2.407781 -0.745719 1.102251
C  -2.085905 0.53382 -0.98244
C  -2.928003 -0.008918 0.013632
H  1.836859 2.302699 0.411098
H  1.73383 1.964506 -1.348907
H  4.103736 2.203615 -1.638251
H  4.167622 2.868749 0.019423
H  1.353511 -2.711566 1.100541
H  -0.599452 -1.463007 2.052261
H  -0.047196 0.719873 -1.671786
H  -3.09246 -1.142806 1.856025
H  -2.529722 1.086061 -1.814736
