program: Gaussian 09
title: 000202112
version: EM64L-G09RevD.01
frameworkgroup: C1[X(C17H21NO2)]
method: RPBEPBE
basis: SDD
operation: Freq
keyword: #p
keyword: freq=noraman
keyword: PBEPBE/SDD
title: #p freq=noraman PBEPBE/SDD
converged: YES YES NO NO
title: Mulliken charges:
elementType: O O N C C C C C C C C C C C C C C C C C H H H H H H H H H H H H H H H H H H H H H
charge: -0.308321 -0.308341 -0.340821 -0.223864 -0.633737 0.415800 0.512638 -0.003901 -0.393554 0.217010 -0.641130 -0.399573 -0.425713 -0.233589 -0.373376 -0.236334 -0.234959 -0.250049 -0.539924 -0.529501 0.258376 0.192368 0.240321 0.253006 0.269232 0.198157 0.215741 0.244343 0.249143 0.229274 0.224847 0.248297 0.227039 0.224021 0.228463 0.219179 0.251711 0.257449 0.219626 0.226857 0.253787
chargesum: 0.00000
title: Mulliken charges with hydrogens summed into heavy atoms:
elementType: O O N C C C C C C C C C C C C C C C C C
charge: -0.308321 -0.308341 -0.087815 0.034512 -0.201048 0.415800 0.512638 -0.003901 -0.124322 0.217010 0.017111 -0.150429 -0.196439 -0.008742 -0.125080 -0.009294 -0.010939 -0.021586 0.188415 0.170770
polarizability: 1.87722034e+02 -4.93715430e+00 2.02233597e+02 -2.48811088e+01 2.83656290e+00 1.77049523e+02
1716.lowfreq: -7.8647 -4.4225 -0.0005 0.0002 0.0004 7.3081 31.6432 40.7965 44.8267
frequency: 31.5057 40.6195 44.8080 65.3927 75.2576 94.0599 106.4679 130.4618 140.6222 141.3934 150.4740 168.5906 187.0106 199.1037 223.4265 237.9156 263.4670 284.7178 342.1547 346.9905 371.4993 377.5332 402.2022 427.4315 448.5897 516.9283 526.3692 552.1505 581.7873 589.6337 612.8721 618.0441 643.4713 703.0265 715.2087 755.3158 763.2229 774.6031 812.4424 816.2806 848.2081 853.2149 911.8138 917.6281 933.2047 944.2566 961.6263 974.5816 975.2021 989.9237 993.6315 999.4869 1022.0994 1028.1117 1061.8728 1082.2215 1104.1352 1114.2386 1116.2641 1136.8094 1143.1648 1146.7325 1153.8100 1164.8932 1170.5077 1173.1500 1179.2297 1187.4684 1219.9483 1232.0430 1250.0194 1284.7690 1312.1750 1322.7967 1329.4543 1366.8075 1381.9655 1417.6742 1426.1440 1432.9814 1438.6174 1445.2751 1451.0055 1457.4092 1460.0179 1461.0036 1467.0458 1470.8986 1478.9093 1483.8667 1488.8540 1495.6239 1586.7467 1590.8938 1595.2465 1613.3101 2888.6421 2920.7278 2969.2163 2971.5291 2985.7422 3026.3726 3048.0832 3065.9510 3080.1161 3088.8758 3113.3365 3118.0639 3119.6078 3122.6305 3129.6807 3134.0266 3144.6613 3147.3306 3162.0380 3165.1859 3438.9758
redmass: 4.4395 4.2758 4.1346 3.4769 3.9996 3.0782 2.8136 3.0345 2.3832 2.8560 1.2876 1.1346 1.5137 3.0107 2.4433 3.0076 5.2152 3.8590 2.4671 4.4214 4.6513 3.4290 2.8207 4.1767 4.7187 3.9982 3.5080 3.9113 4.9409 3.7664 2.4876 5.9288 3.2907 1.9735 2.1207 2.2189 1.8696 4.5766 2.3887 3.2704 4.1085 1.2653 1.4143 1.4649 2.3093 7.5165 4.0349 1.3356 1.3907 6.0110 1.3130 2.7583 2.8051 2.2314 1.9653 1.6170 1.3470 1.2401 1.2327 2.2224 1.8784 1.6335 1.3445 2.0895 1.0774 1.3028 1.4474 1.1203 2.3432 2.1902 2.5011 1.3495 1.3981 1.5171 1.3386 4.4591 7.6966 1.3602 1.3302 1.1688 2.0685 1.7565 1.4269 1.0643 1.5717 1.1413 1.1370 1.1552 1.0687 2.2070 1.0693 1.0513 7.1484 6.0012 6.5320 6.1600 1.0545 1.0826 1.0315 1.0632 1.0287 1.0761 1.0974 1.1030 1.1005 1.1051 1.0869 1.1027 1.1039 1.0862 1.0859 1.0917 1.0961 1.0923 1.1015 1.0984 1.0744
irintensity: 0.1155 0.0243 0.0587 0.2736 0.1967 5.5483 3.5257 3.4003 3.8208 1.8179 0.1800 0.7766 2.6646 3.7514 8.6781 7.2853 8.7004 1.9239 0.6128 0.4593 0.9865 8.4929 0.0952 4.4030 1.9149 21.0214 19.5925 12.4513 11.3617 6.7442 46.1306 2.5490 16.7841 56.1408 9.5001 61.6883 8.7887 22.0053 29.9244 15.0033 13.4258 0.2989 0.3979 2.0452 3.7750 45.2896 56.5477 4.9173 0.4667 0.6848 1.3606 14.3073 11.4255 7.5619 32.3671 4.5679 1.2607 7.0576 4.8137 47.6094 13.0296 4.8509 0.7418 21.4099 0.8780 1.8959 12.8132 1.0427 0.4247 65.6264 49.4370 6.7674 6.6527 15.4237 5.1378 15.0365 0.2685 12.4731 5.7987 7.6652 5.9332 90.4430 28.1253 7.8891 1.7133 4.0399 1.9391 7.1310 3.4073 14.1069 17.7515 13.0370 11.7539 0.9559 1.1298 7.6355 113.7030 27.8146 82.0578 45.8003 46.6641 39.9045 18.8075 26.9738 37.4756 11.4414 7.6062 24.2767 17.1956 1.1691 4.6314 14.8659 38.9697 8.9795 21.3696 17.2741 3.8069
temp: 298.150 k
press: 1.00000 atm
elementType: 8 8 7 6 6 6 6 6 6 6 6 6 6 6 6 6 6 6 6 6 1 1 1 1 1 1 1 1 1 1 1 1 1 1 1 1 1 1 1 1 1
symmnumber: 1
zpe: 893448.0 jmol-1
zpe.correction: 0.340296 hartree
zpe.thermalcorrener: 0.360502 hartree
zpe.thermalcorrenthalpy: 0.361447 hartree
zpe.thermalcorrgfe: 0.291035 hartree
zpe.sumelectzpe: -864.072498 hartree
zpe.sumelectthermal: -864.052292 hartree
zpe.sumelectthermalent: -864.051348 hartree
zpe.sumelectthermalfe: -864.121759 hartree
dipole: 0.3221 0.1497 -1.4679
dipole: 1.5103
quadrupole: -114.4705 -112.7237 -113.0030
quadrupole: -0.5237 -2.5672 0.3045
quadrupole: -1.0715 0.6754 0.3961 -0.5237 -2.5672 0.3045
hfenergy: -864.4127942 hartree
pointgroup: C01 [X(C17H21N1O2)]
dipole: 0.083226 -0.0853377 0.5820994 debye
polarizability: 183.2449094|2.3451745|202.1399075|25.3637988|5.6866317|181.6203374 unknown
InChI: InChI=1S/C17H21NO2/c1-18-15(12-13-8-5-4-6-9-13)14-10-7-11-16(19-2)17(14)20-3/h4-11,15,18H,12H2,1-3H3
charge 0 multiplicity 1
41 atoms
O  -0.988003 0.609882 1.544049
O  -2.771752 2.282533 -0.005912
N  -0.364126 -3.254906 0.387367
C  0.116496 -1.847845 0.438693
C  1.5545 -1.829941 -0.179984
C  -0.845671 -0.944008 -0.337314
C  2.268777 -0.493317 -0.073961
C  -1.339258 0.265373 0.216026
C  -1.249409 -1.311762 -1.645788
C  -2.245058 1.076002 -0.532835
C  -1.638279 -3.511389 1.088266
C  2.170136 0.472336 -1.109522
C  3.048933 -0.177957 1.069211
C  -2.103496 -0.485208 -2.404415
C  -2.604743 0.713134 -1.845951
C  2.831888 1.717283 -1.006587
C  3.712137 1.065591 1.178023
C  3.606622 2.019017 0.137875
C  -0.226936 1.876788 1.690372
C  -3.67235 2.103802 1.156007
H  0.181274 -1.460847 1.481354
H  2.149132 -2.603903 0.348107
H  1.469384 -2.148692 -1.234943
H  0.375667 -3.902393 0.690862
H  -0.896061 -2.270831 -2.040545
H  -1.636011 -3.21052 2.163368
H  -1.880125 -4.587495 1.026932
H  -2.451804 -2.955826 0.589189
H  1.56974 0.245677 -1.998406
H  3.141937 -0.915833 1.876283
H  -2.395997 -0.777081 -3.418969
H  -3.286129 1.368576 -2.398054
H  2.745087 2.448678 -1.818108
H  4.3146 1.287937 2.066344
H  4.125251 2.981207 0.216117
H  -0.09681 2.010692 2.775493
H  -0.79125 2.722178 1.258318
H  0.757699 1.785027 1.199854
H  -4.571089 1.531253 0.85626
H  -3.961934 3.120883 1.46204
H  -3.154269 1.583003 1.981383
