program: Gaussian 09
title: 000202062
version: EM64L-G09RevD.01
frameworkgroup: C1[X(C13H16BrNOS)]
method: RPBEPBE
basis: SDD
operation: Freq
keyword: #p
keyword: freq=noraman
keyword: PBEPBE/SDD
title: #p freq=noraman PBEPBE/SDD
converged: YES YES NO NO
title: Mulliken charges:
elementType: Br S O N C C C C C C C C C C C C C H H H H H H H H H H H H H H H H
charge: -0.002017 0.270225 -0.434033 -0.130247 -0.470496 0.492496 -0.363034 -0.336555 0.404593 -0.400713 -0.750724 -0.326649 -0.676120 -0.331927 -0.253460 -0.218244 -0.206257 0.208912 0.236421 0.218892 0.195393 0.233508 0.196196 0.285571 0.203224 0.216627 0.205104 0.223634 0.215657 0.256863 0.250165 0.253439 0.333557
chargesum: 0.00000
title: Mulliken charges with hydrogens summed into heavy atoms:
elementType: Br S O N C C C C C C C C C C C C C
charge: -0.002017 0.270225 -0.100476 -0.130247 -0.025163 0.492496 0.051251 0.093149 0.404593 -0.400713 -0.465153 0.093201 -0.031725 -0.075064 -0.003295 -0.218244 0.047182
polarizability: 2.51523928e+02 1.96444147e+01 1.96228065e+02 5.82773297e-01 -1.17096253e+01 1.08418799e+02
1716.lowfreq: -2.5406 -0.0018 -0.0015 0.0010 3.9142 5.7567 23.6892 34.4700 48.2636
frequency: 23.5395 34.4033 48.2038 74.3766 85.3614 89.9553 101.1945 128.0676 156.9449 201.1847 223.8906 241.8338 247.9303 255.9471 267.1382 286.1772 301.1073 320.0833 387.2569 407.5554 418.2477 440.6032 487.1336 492.4828 521.8933 555.1390 606.0821 622.2904 702.9395 729.5589 773.4195 788.4138 796.4630 803.1778 805.3257 817.8116 837.3982 880.0040 942.3200 949.3544 959.1287 997.7498 1009.6721 1039.5794 1041.9553 1058.6983 1070.7011 1082.0251 1100.1337 1117.4792 1143.7708 1150.4749 1172.9262 1223.7698 1252.2148 1269.2136 1278.9897 1283.7326 1302.7683 1308.6319 1359.0721 1365.6050 1373.7439 1381.4747 1388.7574 1392.6525 1411.9698 1441.1620 1461.4716 1466.5729 1471.4131 1476.5018 1484.1100 1487.8099 1534.9871 1566.2653 1590.4545 2846.5819 2872.0518 2904.9756 2983.1983 2983.5518 3001.3098 3025.8872 3035.6305 3076.2585 3084.1851 3089.0113 3151.4188 3163.3589 3177.4865 3235.2001 3565.0138
redmass: 5.6515 5.0118 5.1526 3.1483 5.7236 2.0648 3.9501 2.7714 2.5343 4.1195 1.9114 14.2286 4.7765 2.3782 2.5077 5.8253 1.4661 1.9396 2.9202 4.6813 3.0165 3.7627 4.2239 3.6466 10.0787 5.0574 4.6194 5.4219 6.8364 3.8712 5.5179 2.4615 1.2135 1.2891 1.2313 1.4143 3.2005 1.5104 2.5581 1.3435 3.8304 1.8945 5.0313 3.2307 2.0629 2.0005 2.5683 2.6756 2.1381 1.6252 1.3140 1.4487 1.6777 1.9508 1.4024 1.2957 1.2714 1.2777 1.4113 1.5592 1.2462 1.6286 1.3642 5.8654 1.3481 1.2375 3.2337 3.3938 1.0644 1.1151 1.0659 1.0705 1.0812 1.0738 5.9920 7.2464 7.5669 1.0710 1.0715 1.0691 1.0393 1.0629 1.0854 1.0896 1.0887 1.0983 1.0993 1.1002 1.0894 1.0923 1.0966 1.0950 1.0663
irintensity: 0.3764 0.7309 0.2079 1.1069 0.1067 5.8033 2.3065 1.3260 1.3641 1.2237 0.1568 0.2384 3.4936 3.4891 12.1145 3.9562 101.6136 32.8905 27.3953 4.5933 9.4312 1.0456 2.8340 8.5772 3.0205 6.5552 11.6225 8.1016 5.9143 2.8269 52.3657 1.9951 19.5342 43.3231 8.7395 5.9710 20.4001 24.1435 11.2679 0.9359 126.1715 1.1601 38.2647 49.0477 17.4300 24.7332 4.8679 7.5114 27.9509 35.6686 2.6607 6.5663 3.8161 42.9068 8.1183 12.9992 1.8764 10.0798 26.2911 1.7846 18.2272 2.8659 0.2539 11.6908 3.5468 22.3306 37.7986 31.9313 2.2273 2.8158 4.3834 2.8594 9.1497 12.8467 7.8259 19.0577 17.5445 50.3504 87.9731 76.2898 28.4942 60.0380 13.8900 22.4385 11.1185 51.0326 47.8317 42.1203 2.3882 2.0137 4.3320 1.9911 7.0786
temp: 298.150 k
press: 1.00000 atm
elementType: 35 16 8 7 6 6 6 6 6 6 6 6 6 6 6 6 6 1 1 1 1 1 1 1 1 1 1 1 1 1 1 1 1
symmnumber: 1
zpe: 685250.7 jmol-1
zpe.correction: 0.260998 hartree
zpe.thermalcorrener: 0.278862 hartree
zpe.thermalcorrenthalpy: 0.279806 hartree
zpe.thermalcorrgfe: 0.212659 hartree
zpe.sumelectzpe: -1045.174919 hartree
zpe.sumelectthermal: -1045.157055 hartree
zpe.sumelectthermalent: -1045.156111 hartree
zpe.sumelectthermalfe: -1045.223259 hartree
dipole: 2.3458 1.2020 2.0585
dipole: 3.3444
quadrupole: -107.3689 -120.8549 -125.4841
quadrupole: -3.8926 11.0755 -6.3872
quadrupole: 10.5337 -2.9523 -7.5815 -3.8926 11.0755 -6.3872
hfenergy: -1045.4359174 hartree
pointgroup: C01 [X(C13H16Br1N1O1S1)]
dipole: -0.7509552 0.6944077 -0.8277369 debye
polarizability: 238.0152752|-31.0027187|209.4028622|6.8336964|10.6626935|108.7526548 unknown
InChI: InChI=1S/C13H16BrNOS/c1-2-15(5-6-16)8-10-9-17-13-4-3-11(14)7-12(10)13/h3-4,7,9,16H,2,5-6,8H2,1H3
charge 0 multiplicity 1
33 atoms
Br 4.304182 -3.074228 -0.149043
S  1.304373 2.69286 0.657662
O  -5.038701 -1.519088 1.669015
N  -2.347736 -0.005195 -0.552546
C  -1.068445 -0.621395 -0.126839
C  0.031746 0.394444 0.123426
C  -3.520615 -0.841537 -0.196142
C  -2.320183 0.437824 -1.974907
C  1.449627 0.053428 0.181202
C  2.285769 1.181847 0.461571
C  -0.196165 1.733416 0.355956
C  -3.97629 -0.587379 1.257136
C  -3.355298 1.534699 -2.2829
C  2.057858 -1.220666 -0.000103
C  3.686095 1.068296 0.560391
C  3.453351 -1.31841 0.100772
C  4.279389 -0.199077 0.377244
H  -0.708937 -1.376544 -0.872172
H  -1.248705 -1.185041 0.809641
H  -3.3223 -1.932489 -0.321388
H  -4.35519 -0.591586 -0.878599
H  -1.310062 0.840608 -2.171528
H  -2.462847 -0.426838 -2.670098
H  -1.163174 2.232596 0.371165
H  -4.289218 0.470776 1.369884
H  -3.154336 -0.781145 1.9661
H  -4.391701 1.190437 -2.111694
H  -3.180209 2.41732 -1.642864
H  -3.279718 1.847086 -3.340767
H  1.449698 -2.104918 -0.210369
H  4.314976 1.937724 0.775099
H  5.363845 -0.316984 0.448642
H  -5.853878 -1.33704 1.137054
