program: Gaussian 09
title: 000202014
version: EM64L-G09RevD.01
frameworkgroup: C1[X(C14H24N2)]
method: RPBEPBE
basis: SDD
operation: Freq
keyword: #p
keyword: freq=noraman
keyword: PBEPBE/SDD
title: #p freq=noraman PBEPBE/SDD
converged: YES YES NO NO
title: Mulliken charges:
elementType: N N C C C C C C C C C C C C C C H H H H H H H H H H H H H H H H H H H H H H H H
charge: -0.078771 -0.114770 -0.344731 -0.347495 -0.340284 -0.451054 -0.443727 -0.401254 -0.583439 -0.574405 0.386554 -0.278445 -0.160406 -0.605636 -0.135702 -0.123088 0.270377 0.264947 0.263327 0.256834 0.272693 0.294016 0.281001 0.245670 0.247760 0.276827 0.282537 0.223036 0.294650 0.268580 0.263361 0.284475 0.290854 0.276625 0.294882 0.258027 0.295853 0.282117 0.306532 0.301671
chargesum: 2.00000
title: Mulliken charges with hydrogens summed into heavy atoms:
elementType: N N C C C C C C C C C C C C C C
charge: -0.078771 -0.114770 0.190593 0.172665 0.226425 0.075617 0.080860 0.104319 0.243152 0.000925 0.386554 -0.001820 0.134477 0.230361 0.170830 0.178583
polarizability: 1.98302649e+02 2.00964681e+00 1.50983736e+02 -9.92283568e+00 -5.96324057e-01 1.10730834e+02
1716.lowfreq: -30.9900 -7.7191 -0.0001 0.0004 0.0005 7.1850 14.5886 35.6715 62.3742
frequency: -10.0927 35.4753 62.3226 83.2127 132.2372 150.8745 164.7945 172.5995 198.0731 240.0973 269.5599 311.8484 316.7631 333.3091 354.2407 407.6730 413.3255 430.6959 443.0437 462.2171 474.6659 509.5667 527.1755 572.5214 620.9512 672.9177 726.1192 756.9883 762.3158 777.3628 788.8161 826.5541 832.7400 854.8778 855.0239 883.7389 905.7296 924.6767 959.9697 971.0440 979.4299 1001.8821 1025.5196 1027.1238 1029.7546 1038.5116 1049.3837 1074.5967 1109.4760 1115.8013 1117.2164 1131.9343 1152.0469 1173.2740 1175.7478 1181.3840 1195.6237 1202.1743 1229.0723 1237.3607 1264.5901 1279.6542 1294.4226 1308.7800 1322.7384 1325.0214 1335.5928 1351.1540 1352.1742 1357.3553 1365.1795 1372.9051 1400.6462 1420.8926 1433.1060 1449.6994 1453.6509 1457.1831 1460.3400 1463.3502 1467.9555 1473.1819 1476.6037 1481.1209 1482.0673 1493.7277 1500.4598 1509.8510 1572.9872 1618.0507 3000.2814 3007.2121 3009.1382 3011.6476 3013.6435 3017.6666 3024.9177 3031.0380 3034.8319 3061.3089 3064.4949 3080.4235 3084.8890 3089.6236 3096.6173 3103.4664 3129.6076 3140.0746 3150.0588 3162.2103 3169.5106 3184.1777 3193.7116 3208.3464
redmass: 3.1440 3.5772 3.8510 2.7715 3.0725 1.1740 3.2875 1.8851 1.4750 3.5074 1.4651 2.2565 2.5428 2.1180 2.2464 2.5172 2.2544 2.5746 3.0809 3.0399 2.6674 3.1262 3.3071 2.5961 3.7726 3.6479 3.9382 2.4690 2.1851 1.3353 1.2670 2.3114 3.8982 1.9710 2.3130 2.4425 1.4022 1.6895 2.2493 1.9011 1.3823 2.1289 1.8999 1.8401 2.2904 2.0148 2.1953 1.8928 1.4870 1.4084 1.3903 1.6826 2.1157 2.1291 1.9228 1.3905 1.1050 1.3406 1.7174 1.9525 1.2681 1.2073 1.1876 1.3323 1.5168 1.3234 1.3070 1.6325 1.7585 1.3948 1.4397 1.3387 1.2807 1.3448 1.1515 1.1617 1.4071 1.1084 1.1728 1.0874 1.0760 1.0871 1.0700 1.0666 1.1373 1.2717 1.1009 1.3525 5.8964 5.5647 1.0694 1.0630 1.0620 1.0591 1.0603 1.0597 1.0350 1.0366 1.0587 1.0998 1.0984 1.1046 1.1003 1.1072 1.1073 1.1041 1.1035 1.1051 1.1029 1.1021 1.0918 1.0949 1.0955 1.1020
irintensity: 0.0114 0.2207 0.0930 0.2386 0.5825 0.2347 1.1638 0.1705 0.0057 4.3635 0.4083 0.0796 0.8778 0.5102 0.1772 0.5083 0.8331 0.9108 5.5373 0.0726 1.2356 8.8546 1.3638 2.5191 2.7386 8.1339 3.4990 4.9724 4.1969 6.4448 74.3039 5.5511 2.4607 2.3979 42.4746 7.0499 1.0540 27.3507 10.9313 6.5655 0.5782 9.3738 4.7269 6.1459 2.1660 1.5389 0.2549 0.9332 0.0452 0.8408 1.0716 3.1189 15.2235 12.5818 7.3188 4.0694 1.1946 1.9910 3.0143 2.3271 3.5149 3.1390 8.5356 19.6266 0.9405 2.1575 5.1635 0.1217 4.8316 1.1950 0.9833 4.5253 7.1571 15.4676 20.2140 6.6230 14.3490 0.3543 23.5927 24.1238 14.1827 26.8777 21.5097 59.3997 14.5999 66.2546 11.1212 40.4121 26.6569 47.1327 5.2116 7.2343 17.0893 2.8576 12.3372 13.3446 3.1634 6.3491 2.8586 3.6619 8.6077 0.4676 8.8975 5.1872 18.7578 6.0671 3.2610 3.8234 2.3317 1.7956 0.6778 0.5662 5.5900 10.5013
temp: 298.150 k
press: 1.00000 atm
elementType: 7 7 6 6 6 6 6 6 6 6 6 6 6 6 6 6 1 1 1 1 1 1 1 1 1 1 1 1 1 1 1 1 1 1 1 1 1 1 1 1
symmnumber: 1
zpe: 951310.9 jmol-1
zpe.correction: 0.362335 hartree
zpe.thermalcorrener: 0.377412 hartree
zpe.thermalcorrenthalpy: 0.378356 hartree
zpe.thermalcorrgfe: 0.320557 hartree
zpe.sumelectzpe: -655.570359 hartree
zpe.sumelectthermal: -655.555283 hartree
zpe.sumelectthermalent: -655.554339 hartree
zpe.sumelectthermalfe: -655.612137 hartree
dipole: -4.5713 1.4597 0.1548
dipole: 4.8012
quadrupole: 14.7627 -65.4734 -85.9158
quadrupole: -0.1052 -3.5322 -0.7493
quadrupole: 60.3048 -19.9312 -40.3736 -0.1052 -3.5322 -0.7493
hfenergy: -655.9326945 hartree
pointgroup: C01 [X(C14H24N2)]
dipole: 1.7800357 0.6318204 -0.018089 debye
polarizability: 198.1944655|0.4016341|150.501512|-10.7317135|4.014263|111.3212416 unknown
InChI: InChI=1S/C14H24N2/c1-15-10-5-4-8-14(15)9-13-16(2)11-6-3-7-12-16/h4-5,8,10H,3,6-7,9,11-13H2,1-2H3
charge 2 multiplicity 1
40 atoms
N  -1.953436 0.305992 0.03988
N  2.874738 0.905139 0.113701
C  -2.774773 0.448967 -1.288353
C  -2.400423 -0.998423 0.763941
C  -0.467573 0.212555 -0.37137
C  -4.293037 0.36863 -1.073396
C  -3.920052 -1.069963 0.987322
C  -4.701844 -0.925442 -0.336814
C  -2.186573 1.526805 0.924361
C  0.549271 0.155135 0.806332
C  1.960449 -0.126596 0.302162
C  2.376488 -1.446622 0.032123
C  4.159231 0.647644 -0.323329
C  2.514366 2.329397 0.420016
C  3.684887 -1.726588 -0.419311
C  4.589026 -0.656055 -0.599313
H  -2.469353 1.409081 -1.740422
H  -2.434126 -0.378587 -1.936914
H  -2.068937 -1.827901 0.112394
H  -1.854169 -1.044335 1.721034
H  -0.270686 1.087945 -1.016485
H  -0.376793 -0.694106 -0.994518
H  -4.755513 0.401893 -2.077217
H  -4.671121 1.261593 -0.541792
H  -4.247319 -0.313079 1.724478
H  -4.127391 -2.051174 1.452721
H  -5.785568 -0.915253 -0.133736
H  -4.511234 -1.804292 -0.983611
H  -3.264052 1.667897 1.075601
H  -1.70947 1.376413 1.904176
H  -1.77425 2.417541 0.424125
H  0.519501 1.085402 1.395387
H  0.287217 -0.669003 1.491644
H  1.669604 -2.264218 0.200257
H  4.819471 1.509936 -0.437044
H  1.582281 2.609388 -0.093374
H  2.410229 2.467963 1.508593
H  3.31577 2.988356 0.058198
H  3.995322 -2.756681 -0.616712
H  5.614042 -0.818556 -0.940736
