program: Gaussian 09
title: 000202023
version: EM64L-G09RevD.01
frameworkgroup: C1[X(C20H25NS)]
method: RPBEPBE
basis: SDD
operation: Freq
keyword: #p
keyword: freq=noraman
keyword: PBEPBE/SDD
title: #p freq=noraman PBEPBE/SDD
converged: NO YES NO NO
title: Mulliken charges:
elementType: S N C C C C C C C C C C C C C C C C C C C C H H H H H H H H H H H H H H H H H H H H H H H H H
charge: 0.147114 -0.076231 -0.363826 -0.373981 -0.391103 -0.385801 -0.398503 -0.310166 -0.653347 -0.798603 0.526299 0.502482 -0.419492 -0.397149 -0.367051 -0.366245 -0.225496 -0.230733 -0.239473 -0.233079 -0.242557 -0.240116 0.173917 0.205825 0.213101 0.168086 0.191129 0.205671 0.204750 0.191633 0.214012 0.188903 0.195985 0.219188 0.278019 0.256930 0.276435 0.234275 0.236498 0.271125 0.254332 0.225555 0.225134 0.226082 0.224643 0.228218 0.227613
chargesum: 0.00000
title: Mulliken charges with hydrogens summed into heavy atoms:
elementType: S N C C C C C C C C C C C C C C C C C C C C
charge: 0.147114 -0.076231 0.015915 0.007205 0.005698 0.010583 0.004412 0.105007 -0.118399 -0.522168 0.526299 0.502482 -0.185216 -0.160651 -0.095926 -0.111913 0.000059 -0.005600 -0.013391 -0.008436 -0.014339 -0.012503
polarizability: 2.84372794e+02 1.96667000e+01 2.43177342e+02 3.45792952e+00 -1.19025309e+01 1.91241895e+02
1716.lowfreq: -15.2017 -7.2757 -0.0012 -0.0009 0.0016 3.9945 13.7509 15.9691 23.8035
frequency: -11.6506 14.2150 23.4558 33.1503 40.2738 60.9907 62.3549 77.7984 102.4420 131.8809 162.3086 178.1937 217.3846 233.4335 236.7725 261.5228 280.0027 317.4234 333.6583 367.4469 395.1396 402.6204 405.0198 442.5564 447.5302 476.8582 499.0082 551.4720 581.2639 613.2262 614.6036 625.7837 687.9749 699.1608 705.3936 707.5797 750.9351 759.1126 778.3437 787.6732 802.9547 815.8290 848.5364 851.7400 853.3026 855.7806 860.1688 901.8927 927.2366 932.8632 956.4437 977.4813 983.2070 989.0652 989.4295 990.5820 993.1513 995.9046 1000.5187 1026.8380 1028.2658 1042.5437 1056.6286 1074.7868 1078.7968 1083.6487 1102.5585 1118.7627 1146.7145 1155.7852 1159.5522 1170.4716 1171.7198 1172.8694 1177.4748 1186.5192 1190.4054 1209.4536 1231.2948 1252.9620 1259.0014 1265.2126 1266.4236 1287.9252 1297.8617 1320.9373 1329.3635 1337.8615 1338.6144 1341.3175 1348.8994 1363.2165 1379.6423 1388.0048 1388.3777 1435.9687 1440.7207 1449.9217 1454.6554 1460.2262 1460.8204 1466.8779 1473.9389 1479.4565 1479.5268 1481.4615 1590.1904 1592.7909 1608.7830 1611.7387 2818.1131 2828.3503 2869.4653 2966.6457 2985.2346 2986.8467 3012.2415 3018.9276 3024.5416 3030.6639 3034.5582 3036.5690 3046.6172 3055.6003 3100.6215 3115.8170 3119.4050 3121.9954 3127.3374 3134.3241 3140.3568 3144.8804 3152.5661 3162.1454 3164.8225
redmass: 2.8689 5.1495 3.9671 4.4325 3.9864 3.6861 4.5334 4.1591 2.8011 3.1407 5.7159 5.2921 2.7640 2.4368 3.4852 3.4422 4.9045 2.3057 6.3028 2.2280 2.4052 2.8238 2.8647 3.3407 2.8942 3.7141 3.7140 1.8274 5.7454 6.2086 5.8832 5.4867 5.0837 3.6706 1.7479 1.8540 2.1903 2.4330 1.5837 1.8909 1.4531 3.1974 3.6437 1.2662 2.2354 1.6792 1.2525 2.2839 1.4641 1.4432 1.3049 1.4049 1.4113 2.4432 5.2430 5.5309 1.4891 1.3197 1.3122 2.3112 2.1240 2.4697 2.4260 1.5851 1.6020 1.5992 2.1621 2.4843 1.2656 1.6912 1.5697 1.1307 1.0543 1.1683 2.4535 1.1125 1.1398 1.8044 1.3629 1.5152 1.2645 1.1773 1.9168 1.2985 1.3270 1.3002 1.2645 1.3208 1.3754 1.4573 1.4691 1.4019 8.2014 3.2799 1.7717 2.2180 2.1281 1.0908 1.0847 1.0879 1.0837 1.0913 1.0907 1.6518 1.3354 2.2667 6.1120 6.0198 6.0768 6.0997 1.0716 1.0701 1.0703 1.0628 1.0615 1.0610 1.0845 1.0604 1.0877 1.0914 1.0854 1.0918 1.1034 1.1036 1.1077 1.0867 1.0856 1.0865 1.0874 1.0912 1.0925 1.0959 1.0953 1.1015 1.1010
irintensity: 0.1220 0.1405 0.0935 0.0992 0.0583 0.2589 0.4365 0.9288 0.1837 0.9275 1.7466 0.7296 1.7413 0.9365 0.5601 0.3756 0.3964 3.3545 0.3438 3.5637 5.0222 0.2438 0.1811 0.5855 0.2928 3.7227 4.5059 0.6318 9.5450 0.2600 5.5339 19.9006 39.8218 1.3726 88.4111 45.3712 41.2943 16.5736 9.2364 17.5954 0.2216 4.7489 2.4020 0.2223 2.8823 10.3726 0.2997 3.5983 1.1195 2.6313 3.4241 0.0595 0.1959 22.5181 2.3145 0.3442 2.0677 0.0282 1.0681 4.9052 13.2877 13.3377 4.4726 15.8814 5.5674 14.5562 44.7235 5.9188 8.1358 20.5604 15.6933 1.3142 0.1723 7.7979 1.5718 2.1202 2.0735 1.8413 5.4966 6.8951 2.6691 5.7150 2.9574 2.0128 13.6606 2.2656 5.5223 0.7865 1.9347 6.4016 1.2233 3.0468 0.6443 0.6362 1.0353 15.8186 8.1699 6.7266 3.3747 13.6616 6.8367 14.4958 2.6638 5.1545 13.9886 27.1929 1.7744 0.7030 8.5741 2.6721 47.0245 151.4495 95.3637 41.3374 32.9513 34.8397 12.8553 18.6069 38.0021 65.2642 49.9433 22.0669 18.2758 99.1629 17.4040 6.3047 4.7205 0.1325 1.1905 8.9159 26.4941 29.0205 31.2068 32.8236 23.3740
temp: 298.150 k
press: 1.00000 atm
elementType: 16 7 6 6 6 6 6 6 6 6 6 6 6 6 6 6 6 6 6 6 6 6 1 1 1 1 1 1 1 1 1 1 1 1 1 1 1 1 1 1 1 1 1 1 1 1 1
symmnumber: 1
zpe: 1046902.8 jmol-1
zpe.correction: 0.398744 hartree
zpe.thermalcorrener: 0.418929 hartree
zpe.thermalcorrenthalpy: 0.419874 hartree
zpe.thermalcorrgfe: 0.346634 hartree
zpe.sumelectzpe: -1228.296107 hartree
zpe.sumelectthermal: -1228.275922 hartree
zpe.sumelectthermalent: -1228.274978 hartree
zpe.sumelectthermalfe: -1228.348217 hartree
dipole: 1.0090 0.6213 0.7245
dipole: 1.3889
quadrupole: -130.3952 -133.3810 -134.0743
quadrupole: -1.4538 -1.3196 -5.1486
quadrupole: 2.2216 -0.7641 -1.4575 -1.4538 -1.3196 -5.1486
hfenergy: -1228.6948517 hartree
pointgroup: C01 [X(C20H25N1S1)]
dipole: -0.407562 0.3006306 -0.205191 debye
polarizability: 286.0125322|-17.8317668|230.3985948|-2.5292957|24.123965|202.3809042 unknown
InChI: InChI=1S/C20H25NS/c1-4-10-18(11-5-1)20(19-12-6-2-7-13-19)22-17-16-21-14-8-3-9-15-21/h1-2,4-7,10-13,20H,3,8-9,14-17H2
charge 0 multiplicity 1
47 atoms
S  0.316442 -1.358181 0.270313
N  -3.784893 -0.680101 0.084552
C  -4.278051 -1.370141 -1.135658
C  -4.815639 -0.666807 1.154922
C  -5.542621 -0.683154 -1.689323
C  -6.099487 0.041482 0.673474
C  -6.646124 -0.625953 -0.609033
C  -2.471557 -1.195406 0.543268
C  -1.320393 -0.540181 -0.242206
C  1.546181 -0.103796 -0.527274
C  1.441866 1.29847 0.065275
C  2.931923 -0.742343 -0.441431
C  1.665653 2.414784 -0.781996
C  3.308735 -1.702859 -1.416886
C  1.167888 1.530946 1.436723
C  3.849747 -0.420618 0.589368
C  1.623631 3.731742 -0.271704
C  4.573211 -2.326994 -1.366076
C  1.125224 2.846617 1.949923
C  5.116061 -1.046479 0.643149
C  1.354264 3.95264 1.098808
C  5.483172 -2.000613 -0.332618
H  -4.513084 -2.446273 -0.914633
H  -3.478525 -1.361909 -1.898891
H  -4.397906 -0.138013 2.031902
H  -5.075782 -1.708589 1.484033
H  -5.898095 -1.232423 -2.58251
H  -5.279979 0.344204 -2.007185
H  -5.860244 1.102188 0.464989
H  -6.856593 0.018056 1.480944
H  -7.530153 -0.076941 -0.984925
H  -6.981727 -1.657147 -0.37223
H  -2.407013 -2.309474 0.458453
H  -2.349602 -0.949283 1.614361
H  -1.263523 0.534645 -0.0063
H  -1.444719 -0.669938 -1.330963
H  1.246819 -0.066883 -1.591161
H  1.879422 2.250336 -1.845673
H  2.599473 -1.966119 -2.211198
H  0.965224 0.671888 2.086914
H  3.580321 0.329013 1.340084
H  1.796048 4.581718 -0.941704
H  4.848969 -3.065161 -2.127662
H  0.908613 3.008842 3.012086
H  5.816385 -0.785982 1.444902
H  1.3165 4.973201 1.496123
H  6.466337 -2.482907 -0.291026
