program: Gaussian 09
title: 000201986
version: EM64L-G09RevD.01
frameworkgroup: C1[X(C13H10N2O4)]
method: RPBEPBE
basis: SDD
operation: Freq
keyword: #p
keyword: freq=noraman
keyword: PBEPBE/SDD
title: #p freq=noraman PBEPBE/SDD
converged: NO YES NO NO
title: Mulliken charges:
elementType: O O O O N N C C C C C C C C C C C C C H H H H H H H H H H
charge: -0.429177 -0.314968 -0.222687 -0.223172 -0.500906 0.019106 0.330525 0.465956 0.050471 -0.363582 -0.412427 -0.345488 -0.294569 0.384280 -0.345649 -0.373807 -0.217676 -0.249390 0.154790 0.372917 0.270238 0.252202 0.272122 0.278843 0.287279 0.285990 0.236472 0.240418 0.391890
chargesum: 0.00000
title: Mulliken charges with hydrogens summed into heavy atoms:
elementType: O O O O N N C C C C C C C C C C C C C
charge: -0.037286 -0.314968 -0.222687 -0.223172 -0.127989 0.019106 0.330525 0.465956 0.050471 -0.093344 -0.160225 -0.073366 -0.015726 0.384280 -0.058370 -0.087818 0.018796 -0.008973 0.154790
polarizability: 3.79455617e+02 1.26363358e+01 1.88474335e+02 3.30996048e+00 1.00768229e+01 7.72838399e+01
1716.lowfreq: -4.8373 -2.2224 -0.0006 0.0006 0.0006 3.4537 33.3391 36.7368 59.8295
frequency: 33.3341 36.7205 59.8278 83.8133 91.4583 133.9215 146.2121 182.3786 197.8101 255.4132 279.4506 288.5699 343.3777 403.7282 411.5312 416.7487 426.4304 493.8921 508.9649 513.9353 522.5174 582.0699 592.7766 605.0670 628.3520 656.1562 667.4428 684.5636 726.9630 740.2741 752.8856 772.8293 779.7017 809.4912 822.5858 838.3599 863.8280 884.2465 888.3856 971.0487 984.3851 989.7569 995.7396 999.0461 1015.7650 1045.5689 1098.6951 1110.9234 1120.7178 1164.3041 1178.8377 1184.2691 1224.9646 1231.6722 1264.4849 1306.5353 1324.8907 1343.3225 1351.2409 1382.4166 1399.4163 1435.8797 1446.5351 1465.7416 1489.5042 1527.9077 1577.5873 1584.1584 1605.5362 1622.1250 1646.8606 3139.5797 3143.4886 3161.6260 3168.7147 3178.2835 3184.3609 3185.3465 3189.6310 3232.4240 3533.2874
redmass: 7.0659 6.6960 8.4574 5.4845 8.2069 8.5789 4.7564 8.2649 7.0368 5.6198 6.2720 6.2485 5.8266 8.6038 6.5474 3.3583 3.2553 3.3779 6.8668 5.1423 3.6787 1.2034 5.2063 6.1842 7.1539 6.0400 4.9605 4.4155 4.9000 3.2208 4.3969 2.4253 2.5390 4.2392 1.3747 1.3641 1.7996 1.5199 2.9373 1.3652 1.3297 1.3543 2.6807 1.3914 5.1059 2.1848 3.1088 1.7612 1.3587 1.6433 1.2299 1.3143 2.9443 2.6917 1.6980 1.3970 2.1450 2.6326 6.9941 6.8525 7.9872 3.4043 3.3701 2.5503 2.5812 3.6013 7.1539 6.9443 4.8183 5.1537 2.3443 1.0875 1.0907 1.0905 1.0893 1.0936 1.0958 1.0977 1.0964 1.0801 1.0642
irintensity: 0.3998 1.2314 0.5928 1.4076 1.5475 2.6810 0.3126 2.1709 3.5393 3.7358 1.6969 4.4893 1.3629 2.9242 6.7911 18.7525 8.8655 10.9054 1.5794 18.4050 12.5627 111.0053 30.6919 32.1908 1.2217 0.2671 45.4420 33.5564 10.4745 16.9281 6.9922 58.7672 23.1449 31.1312 31.2391 30.0364 125.2547 3.9171 29.0592 0.8283 2.5199 3.2719 0.3032 2.1731 347.2082 19.1115 39.0840 178.1574 50.0929 275.2214 62.4419 164.1826 364.6215 333.4489 2.8737 0.4500 50.1008 311.3484 67.0325 52.3386 14.8738 15.6499 69.8818 172.6506 14.6305 358.2292 42.5489 243.5687 567.9681 33.2690 130.2667 6.0560 3.9319 12.0037 1.4861 5.1238 2.9912 4.6694 4.8164 321.4907 84.8393
temp: 298.150 k
press: 1.00000 atm
elementType: 8 8 8 8 7 7 6 6 6 6 6 6 6 6 6 6 6 6 6 1 1 1 1 1 1 1 1 1 1
symmnumber: 1
zpe: 552271.6 jmol-1
zpe.correction: 0.210349 hartree
zpe.thermalcorrener: 0.225896 hartree
zpe.thermalcorrenthalpy: 0.226840 hartree
zpe.thermalcorrgfe: 0.165989 hartree
zpe.sumelectzpe: -910.397951 hartree
zpe.sumelectthermal: -910.382404 hartree
zpe.sumelectthermalent: -910.381460 hartree
zpe.sumelectthermalfe: -910.442311 hartree
dipole: 8.0430 0.5679 -0.3956
dipole: 8.0727
quadrupole: -139.1820 -97.2669 -111.1247
quadrupole: 1.0059 2.8569 -0.4758
quadrupole: -23.3242 18.5910 4.7332 1.0059 2.8569 -0.4758
hfenergy: -910.6083002 hartree
pointgroup: C01 [X(C13H10N2O4)]
dipole: -3.1688293 0.1742324 0.1242988 debye
polarizability: 379.8456734|-8.236949|184.7972968|5.7278401|-21.2195408|80.5708216 unknown
InChI: InChI=1S/C13H10N2O4/c16-13(17)11-3-1-2-4-12(11)14-9-5-7-10(8-6-9)15(18)19/h1-8,14,16H
charge 0 multiplicity 1
29 atoms
O  -4.632099 -2.029755 -0.325387
O  -2.438241 -2.548239 0.178804
O  5.69764 -0.780672 0.464732
O  5.416782 1.16343 -0.703184
N  -0.692345 -0.54476 0.315527
N  4.951056 0.127401 -0.079686
C  -1.772094 0.337325 0.186241
C  0.687815 -0.3058 0.211138
C  -3.101319 -0.201077 -0.002026
C  -1.63141 1.752968 0.294998
C  1.561957 -1.271109 0.800717
C  1.258238 0.791748 -0.502348
C  -4.210313 0.681596 -0.129018
C  3.492775 -0.025917 0.016486
C  2.952864 -1.137396 0.707017
C  2.651269 0.930452 -0.596902
C  -2.74649 2.598533 0.174375
C  -4.044113 2.072674 -0.056407
C  -3.319684 -1.655821 -0.03609
H  -0.98939 -1.533683 0.433367
H  -0.654915 2.184844 0.524231
H  1.130866 -2.120481 1.34209
H  0.616477 1.501957 -1.028209
H  -5.200737 0.243507 -0.27765
H  3.630208 -1.864866 1.161459
H  3.102576 1.757564 -1.151321
H  -2.605828 3.680434 0.275604
H  -4.904654 2.740543 -0.155939
H  -4.690392 -3.022605 -0.315718
